{"text_format":"1","workbook":"xlsx","n_sheets":36,"sheets":["Introduction","Read Me","TOC","Definitions","Control Sheet","CompletionTracker","Stationary-Entry","StatTemplateReadMe","Stationary-Data","Stationary-Calcs","ElecTemplateReadMe","Mobile-Entry","Mobile-Data","MobTemplateReadMe","Mobile-Summary","Mobile-Detail Calcs","Solid Waste-Control","Solid Waste-Entry","Wastewater-Control","Wastewater-Entry","Wastewater- Calcs","Electricity-Entry","Electricity-Data","Electricity-Calcs","Employee Commute","Water","Agriculture & Land Management","Urban Forestry","Waste Production","Additional Emission Sources","Summary-Emissions","Factors","Background Controls","Help","Detail Type Data","Notes"],"not_rendered":{"charts":25,"images":32,"macros":1,"external_links":0,"defined_names":350,"comments":1,"pivot_tables":0},"unopened":[],"bounds":{"document_bytes":16777216,"sheet_cells":100000,"rows_first":2000,"rows_last":500,"rows_between":2000,"halvings":0,"cell_chars":16384,"cell_head_chars":4096},"cells_cut":0,"cells_raw":0,"read":"whole","date_system":"1900"}

{"sheet":"Introduction","index":0,"n_rows":36,"n_cols":1,"rows_kept":36,"cut":false,"hidden":false,"merged":[[35,0,35,12]]}
["Introduction"]
[]
[]
[]
[]
[]
[]
[]
{"$rows_left_out":29}
{"sheet":"Read Me","index":1,"n_rows":69,"n_cols":1,"rows_kept":69,"cut":false,"hidden":false,"merged":[[68,0,68,19]]}
["Read Me"]
[]
[]
[]
[]
[]
[]
[]
{"$rows_left_out":62}
{"sheet":"TOC","index":2,"n_rows":42,"n_cols":1,"rows_kept":42,"cut":false,"hidden":false,"merged":[[41,0,41,21]]}
["Table of Contents"]
[]
[]
[]
[]
[]
[]
[]
{"$rows_left_out":35}
{"sheet":"Definitions","index":3,"n_rows":47,"n_cols":3,"rows_kept":47,"cut":false,"hidden":false,"merged":[[46,0,46,8]]}
["Definitions"]
[]
[null,"Please refer to this list for an explanation of any terms you may find within this tool."]
[]
[null,"Term","Definition"]
[null,"Base Year","A measurement, calculation, or time used as a basis for comparison. According to LGOP, it is good practice to aim for a base year that is likely to be representative of the general level of emissions over the surrounding period."]
[null,"BAU","Business As Usual. Used to refer to a future scenario in which there are no changes to the status quo."]
[null,"Biogenic","Biogenic emissions or fuels are produced by the biological processes of living organisms. Note that this term refers only to recently produced (i.e., non-fossil) material of biological origin"]
{"$rows_left_out":40}
{"sheet":"Control Sheet","index":4,"n_rows":91,"n_cols":8,"rows_kept":91,"cut":false,"hidden":false,"merged":[[41,4,41,6],[39,1,39,12],[8,1,8,7],[90,0,90,13],[43,1,43,2],[37,0,37,7]]}
["Inventory Control Sheet"]
["Complete the 5 steps below to set up the tool for your tribe."]
["1) Please enter the name of your tribe, the inventory year, and population below."]
[]
[null,"Tribe"]
[null,"Year"]
[null,"Population"]
["2) Please specify the number of departments in your tribe here by using the button to the right of the input cell below."]
{"$rows_left_out":84}
{"sheet":"CompletionTracker","index":5,"n_rows":24,"n_cols":2,"rows_kept":24,"cut":false,"hidden":true,"merged":[]}
["CompletionTracker"]
[]
[]
["Control Sheet",false]
["Stationary-Entry",false]
["Stationary-Data",false]
["Electricity-Entry",false]
["Electricity-Data",false]
{"$rows_left_out":17}
{"sheet":"Stationary-Entry","index":6,"n_rows":25,"n_cols":6,"rows_kept":25,"cut":false,"hidden":false,"merged":[[24,0,24,5]]}
["Stationary Combustion - Entry"]
["Data Entry & Calculations"]
[]
[]
[]
[]
["1)","Describe the fuel consuming unit you are entering"]
[null,"ID#","Unit Description","Facility Type (if applicable)","Department"]
{"$rows_left_out":18}
{"sheet":"StatTemplateReadMe","index":7,"n_rows":36,"n_cols":3,"rows_kept":36,"cut":false,"hidden":true,"merged":[[25,1,25,2],[0,1,0,2],[1,1,1,2],[2,1,2,2],[3,1,3,2],[23,1,23,2],[24,1,24,2],[4,1,4,2],[5,1,5,2],[6,1,6,2],[7,1,7,2],[8,1,8,2],[9,1,9,2]]}
["Stationary Data Template Instructions","This sheet describes the file layout and data parameters needed for batch import."]
[null,"This will allow you to bypass the data entry form and upload multiple lines of data."]
[null,"Please enter your activity data on the following worksheet (DataSheet) according to the parameters below."]
[null,"Copy and paste the data from that sheet onto the \"Stationary-Data\" worksheet in the inventory tool."]
["ID#","This value is automatically supplied when adding data via the input form. You will need to update this manually when using the batch import feature. Please assign a unique value to each line of data you add."]
[null,"Values must be integers in ascending order. Gaps between numbers are permitted. For example, three lines with IDs in order of 11, 12, and 15 are ok; IDs of 11, 15, and 12 is not. The calculations will not be accurate if the ID numbers do not meet this condition."]
[null,"It is recommended that you begin with the highest previous number and increase each additional line by 1."]
["Unit Description","Use this field to describe or name the unit or group that you are entering. This field is for the user's reference only and does not impact the calculations."]
{"$rows_left_out":29}
{"sheet":"Stationary-Data","index":8,"n_rows":8,"n_cols":7,"rows_kept":8,"cut":false,"hidden":false,"merged":[]}
["Stationary Combustion - Data"]
[]
[]
[]
["Linker Row"]
["ID#","Unit Description","Department","Fuel Type","Amount Consumed","Unit","Facility Type"]
[{"$f":"MAX(A9:A65521)+1","v":1},{"$f":"stat_entry_description","v":0},{"$f":"stat_entry_dept","v":0},{"$f":"stat_entry_fuel","v":0},{"$f":"stat_entry_consumption","v":0},{"$f":"IF(ISNA(VLOOKUP(D7,stat_factors,6,FALSE)), \" \", VLOOKUP(D7, stat_factors, 6, FALSE))","v":" "},{"$f":"stat_entry_bldgtype","v":0}]
["Saved Data"]
{"$rows_left_out":1}
{"sheet":"Stationary-Calcs","index":9,"n_rows":281,"n_cols":19,"rows_kept":281,"cut":false,"hidden":false,"merged":[[280,0,280,16],[20,1,20,5],[20,8,20,12],[72,1,72,5],[72,8,72,11],[85,8,85,10]]}
["Stationary Combustion - Calculation & Summary "]
["Jump to…"]
["Department Summary"]
["Emissions by Department"]
["Fuel and Energy Consumption by Department"]
["Fuel Summary"]
["Emissions by Fuel Type"]
["Fuel and Energy Consumption by Type"]
{"$rows_left_out":274}
{"sheet":"ElecTemplateReadMe","index":10,"n_rows":23,"n_cols":2,"rows_kept":23,"cut":false,"hidden":true,"merged":[[5,1,5,2],[0,1,0,2],[1,1,1,2],[2,1,2,2],[3,1,3,2],[4,1,4,2],[22,1,22,2],[8,1,8,2],[6,1,6,2],[7,1,7,2],[20,1,20,2],[21,1,21,2]]}
["Electricity Data Template Instructions","This sheet describes the file layout and data parameters needed for batch import."]
[null,"This will allow you to bypass the data entry form and upload multiple lines of data."]
[null,"Please enter your activity data on the following worksheet (DataSheet) according to the parameters below."]
[null,"Copy and paste the data from that sheet onto the \"Electricity-Data\" worksheet in the inventory tool."]
["ID#","This value is automatically supplied when adding data via the input form. You will need to update this manually when using the batch import feature. Please assign a unique value to each line of data you add."]
[null,"Values must be integers in ascending order. Gaps between numbers are permitted. For example, three lines with IDs in order of 11, 12, and 15 are ok; IDs of 11, 15, and 12 is not. The calculations will not be accurate if the ID numbers do not meet this condition."]
[null,"It is recommended that you begin with the highest previous number and increase each additional line by 1."]
["Unit Description","Use this field to describe or name the unit or group that you are entering. This field is for the user's reference only and does not impact the calculations."]
{"$rows_left_out":16}
{"sheet":"Mobile-Entry","index":11,"n_rows":42,"n_cols":8,"rows_kept":42,"cut":false,"hidden":false,"merged":[[27,3,28,6],[29,4,29,5],[29,3,30,3],[41,0,41,6],[33,1,34,2]]}
["Mobile Combustion - Entry"]
["Data Entry & Calculations"]
[]
[]
[]
[]
[]
[]
{"$rows_left_out":35}
{"sheet":"Mobile-Data","index":12,"n_rows":8,"n_cols":9,"rows_kept":8,"cut":false,"hidden":false,"merged":[]}
["Mobile Combustion - Data"]
[]
[]
[]
["Linker Row- DO NOT MODIFY"]
["ID#","Vehicle or vehicle group description","Department","Vehicle Year","Vehicle Type","Vehicle Model (optional)","Fuel type","Fuel consumption","VMT"]
[{"$f":"MAX(A9:A65536)+1","v":1},{"$f":"mob_entry_description","v":0},{"$f":"mob_entry_dept","v":0},{"$f":"mob_entry_vehyear","v":0},{"$f":"mob_entry_vehtype","v":0},{"$f":"mob_entry_vehmodel","v":0},{"$f":"mob_entry_fuel","v":0},{"$f":"mob_entry_fuelconsumption","v":0},{"$f":"mob_entry_vmt","v":0}]
["Saved Data"]
{"$rows_left_out":1}
{"sheet":"MobTemplateReadMe","index":13,"n_rows":66,"n_cols":3,"rows_kept":66,"cut":false,"hidden":true,"merged":[[5,1,5,2],[9,1,9,2],[10,1,10,2],[24,1,24,2],[26,1,26,2],[0,1,0,2],[1,1,1,2],[2,1,2,2],[3,1,3,2],[4,1,4,2],[65,1,65,2],[6,1,6,2],[7,1,7,2],[8,1,8,2],[25,1,25,2],[64,1,64,2]]}
["Mobile Data Template Instructions","This sheet describes the file layout and data parameters needed for batch import."]
[null,"This will allow you to bypass the data entry form and upload multiple lines of data."]
[null,"Please enter your activity data on the following worksheet (DataSheet) according to the parameters below."]
[null,"Copy and paste the data from that sheet onto the Mobile-Data\" worksheet in the inventory tool."]
["ID#","This value is automatically supplied when adding data via the input form. You will need to update this manually when using the batch import feature. Please assign a unique value to each line of data you add."]
[null,"Values must be integers in ascending order. Gaps between numbers are permitted. For example, three lines with IDs in order of 11, 12, and 15 are ok; IDs of 11, 15, and 12 is not. The calculations will not be accurate if the ID numbers do not meet this condition."]
[null,"It is recommended that you begin with the highest previous number and increase each additional line by 1."]
["Vehicle or Vehicle Group Descriptions","Use this field to describe or name the vehicle or group of vehicles that you are entering. This field is for the user's reference only and does not impact the calculations."]
{"$rows_left_out":59}
{"sheet":"Mobile-Summary","index":14,"n_rows":81,"n_cols":19,"rows_kept":81,"cut":false,"hidden":false,"merged":[[4,1,4,5],[4,8,4,10],[31,1,31,13],[80,0,80,15]]}
["Mobile Combustion - Summary"]
[]
["GHG Summary"]
[]
[null,"Net Emissions by Department (CO2e)",null,null,null,null,null,null,"CO2 Detail Emissions"]
[null,null,"CO2","CH4","N2O","TOTAL",null,null,"Gross CO2","- Biogenic =","Net CO2"]
["Dstart",{"$f":"B34","v":0},{"$f":"'Mobile-Detail Calcs'!N129","v":0},{"$f":"'Mobile-Detail Calcs'!C251","v":0},{"$f":"'Mobile-Detail Calcs'!D251","v":0},{"$f":"SUM(C7:E7)","v":0},null,null,{"$f":"'Mobile-Detail Calcs'!N77","v":0},{"$f":"'Mobile-Detail Calcs'!N103","v":0},{"$f":"'Mobile-Detail Calcs'!N129","v":0}]
[null,0,{"$f":"'Mobile-Detail Calcs'!N130","v":0},{"$f":"'Mobile-Detail Calcs'!C252","v":0},{"$f":"'Mobile-Detail Calcs'!D252","v":0},{"$f":"SUM(C8:E8)","v":0},null,null,{"$f":"'Mobile-Detail Calcs'!N78","v":0},{"$f":"'Mobile-Detail Calcs'!N104","v":0},{"$f":"'Mobile-Detail Calcs'!N130","v":0}]
{"$rows_left_out":74}
{"sheet":"Mobile-Detail Calcs","index":15,"n_rows":275,"n_cols":27,"rows_kept":275,"cut":false,"hidden":false,"merged":[[161,2,161,4],[274,0,274,15]]}
["Mobile Combustion - Calculation"]
["Jump to…"]
["Activity Data"]
["Fuel use by department and fuel type"]
["Energy use by department and fuel type"]
["CO2 Calculations"]
["Gross CO2"]
["Biogenic CO2"]
{"$rows_left_out":268}
{"sheet":"Solid Waste-Control","index":16,"n_rows":42,"n_cols":14,"rows_kept":42,"cut":false,"hidden":false,"merged":[[14,2,14,5],[16,2,16,10],[41,0,41,11]]}
["Solid Waste - Control"]
[]
[]
[]
[]
[]
[1,"Please answer the following questions about your tribe's solid waste services."]
[]
{"$rows_left_out":35}
{"sheet":"Solid Waste-Entry","index":17,"n_rows":107,"n_cols":17,"rows_kept":107,"cut":false,"hidden":false,"merged":[[74,1,74,2],[106,0,106,13]]}
["Solid Waste - Entry, Calculation & Summary"]
[]
[]
[]
[]
[]
[]
[]
{"$rows_left_out":100}
{"sheet":"Wastewater-Control","index":18,"n_rows":64,"n_cols":19,"rows_kept":64,"cut":false,"hidden":false,"merged":[[9,16,9,18],[63,0,63,14]]}
["Wastewater - Control"]
[]
[]
[null,"Please answer the following questions about your wastewater treatment system."]
[]
[null,"1) To which tribal department does your wastewater treatment system belong?"]
[null,null,0]
[]
{"$rows_left_out":57}
{"sheet":"Wastewater-Entry","index":19,"n_rows":48,"n_cols":3,"rows_kept":48,"cut":false,"hidden":false,"merged":[[47,0,47,10]]}
["Wastewater - Entry"]
[]
[]
[]
[]
[]
[]
[]
{"$rows_left_out":41}
{"sheet":"Wastewater- Calcs","index":20,"n_rows":90,"n_cols":14,"rows_kept":90,"cut":false,"hidden":false,"merged":[[11,1,11,3],[13,1,13,2],[14,1,14,2],[15,1,15,2],[16,1,16,2],[89,0,89,14],[20,1,20,10],[25,1,25,11],[30,1,30,9],[35,1,35,11],[40,1,40,9],[73,1,73,7],[45,1,45,7],[50,1,50,7],[55,1,55,8],[60,1,60,13],[62,1,62,13],[64,1,64,13],[66,1,66,13],[68,1,68,13],[70,1,70,13]]}
["Wastewater - Calculation & Sumary"]
[]
[]
[]
[]
[]
[]
[]
{"$rows_left_out":83}
{"sheet":"Electricity-Entry","index":21,"n_rows":22,"n_cols":6,"rows_kept":22,"cut":false,"hidden":false,"merged":[[21,0,21,5]]}
["Electricity Use - Entry"]
["Data Entry & Calculations"]
[]
[]
[]
[]
[]
["1)","Describe the electricity consuming unit you are entering"]
{"$rows_left_out":15}
{"sheet":"Electricity-Data","index":22,"n_rows":8,"n_cols":6,"rows_kept":8,"cut":false,"hidden":false,"merged":[]}
["Electricity Use - Data"]
[]
[]
[]
["Linker Row"]
["ID#","Unit Description","Department","Utility","Electricity Consumed (kWh)","Facility Type"]
[{"$f":"MAX(A9:A65514)+1","v":1},{"$f":"elec_entry_description","v":0},{"$f":"elec_entry_dept","v":0},{"$f":"elec_entry_utility","v":"Select eGRID Subregion…"},{"$f":"elec_entry_consumption","v":0},{"$f":"elec_entry_bldgtype","v":0}]
["Saved Data"]
{"$rows_left_out":1}
{"sheet":"Electricity-Calcs","index":23,"n_rows":240,"n_cols":9,"rows_kept":240,"cut":false,"hidden":false,"merged":[[17,1,17,5],[61,1,61,2],[239,0,239,12]]}
["Electricity Use - Calculation & Summary "]
["Jump to…"]
["GHG Summary"]
["Emissions by Department"]
["Electricity Summary"]
["Electricity Use by Department"]
["Background Calculations"]
["CO2 emissions by utility"]
{"$rows_left_out":233}
{"sheet":"Employee Commute","index":24,"n_rows":188,"n_cols":11,"rows_kept":188,"cut":false,"hidden":false,"merged":[[187,0,187,13],[52,4,52,12],[60,1,60,2],[37,0,38,12],[54,0,55,12],[133,0,133,13],[50,0,50,13]]}
["Employee Commute"]
["Jump to…"]
["Step 1. Enter employee data by department"]
["Step 2. Enter mode of transportation proportions"]
["Employee Commute Emissions Summary"]
["Chart: Employee Commute Emissions"]
["Background Calculations"]
[]
{"$rows_left_out":181}
{"sheet":"Water","index":25,"n_rows":243,"n_cols":18,"rows_kept":243,"cut":false,"hidden":false,"merged":[[242,0,242,11],[50,1,50,5],[129,1,129,3],[155,1,155,3],[182,1,182,3],[209,1,209,3]]}
["Water"]
["Data Entry and Calculations"]
[]
[]
[]
[]
[]
[]
{"$rows_left_out":236}
{"sheet":"Agriculture & Land Management","index":26,"n_rows":69,"n_cols":6,"rows_kept":69,"cut":false,"hidden":false,"merged":[[68,0,68,21],[33,1,33,4]]}
["Agriculture & Land Management"]
["Data Entry & Calculations"]
[]
[]
[]
[]
["1. Enter Fertilizer Consumption Data for Each Department."]
["Please enter the amount of synthetic, organic, or manure fertilizer applied."]
{"$rows_left_out":62}
{"sheet":"Urban Forestry","index":27,"n_rows":69,"n_cols":4,"rows_kept":69,"cut":false,"hidden":false,"merged":[[68,0,68,21],[34,1,34,3]]}
["Urban Forestry"]
[]
[]
[]
[]
[]
["1. Enter Forestry Data"]
["Please enter the total urban area and percent of that area with tree cover below in your locality."]
{"$rows_left_out":62}
{"sheet":"Waste Production","index":28,"n_rows":41,"n_cols":4,"rows_kept":41,"cut":false,"hidden":false,"merged":[[8,1,8,3],[40,0,40,13]]}
["Waste Generation"]
[]
[]
[null,"To calculate Scope 3 emissions from waste, please visit  EPA's WAste Reduction Model (WARM). WARM is available both as a web-based calculator and in an Excel spreadsheet."]
[null,"http://www.epa.gov/climatechange/wycd/waste/calculators/Warm_home.html"]
[]
[{"$f":"IF('Solid Waste-Control'!$A$10=2, \"Show\", \"Hide\")","v":"Hide"},"Please enter the results from EPA's WARM model here. "]
[{"$f":"IF('Solid Waste-Control'!$A$10=2, \"Show\", \"Hide\")","v":"Hide"}]
{"$rows_left_out":34}
{"sheet":"Additional Emission Sources","index":29,"n_rows":29,"n_cols":17,"rows_kept":29,"cut":false,"hidden":false,"merged":[[13,4,13,10],[28,0,28,14]]}
["Additional Emission Sources"]
[]
[]
[]
[]
[]
[]
[]
{"$rows_left_out":22}
{"sheet":"Summary-Emissions","index":30,"n_rows":151,"n_cols":24,"rows_kept":151,"cut":false,"hidden":false,"merged":[[10,1,10,9],[40,1,40,3],[2,1,2,9],[113,0,113,20],[87,1,87,13]]}
["Inventory Emissions Summary"]
[null,null,null,null,null,{"$f":"IF(SUM('Additional Emission Sources'!H16:H25)>0, \"Show\", \"Hide\")","v":"Hide"},{"$f":"IF(SUM('Additional Emission Sources'!I16:I25)>0, \"Show\", \"Hide\")","v":"Hide"},{"$f":"IF(SUM('Additional Emission Sources'!J16:J25)>0, \"Show\", \"Hide\")","v":"Hide"}]
[null,{"$f":" \"Total \" &MyCity &\" Emissions\"","v":"Total  Emissions"},null,null,null,null,null,null,null,null,null,null,{"$f":"IF(ISERROR(I24/myPopulation),0,I24/myPopulation)","v":0},{"$f":"\"Per capita Emissions for\"&MyCity &\"  (MT CO2e/person) \"","v":"Per capita Emissions for  (MT CO2e/person) "}]
[null,null,"CO2","CH4","N2O","HFCs","PFCs","SF6","Total MT CO2e","Percent of Total"]
[null,"Scope 1",{"$f":"SUMIF($A$13:$A$23, RIGHT($B5, 1), C$13:C$23)+SUMIF('Additional Emission Sources'!$D$16:$D$25,  RIGHT($B5,1), 'Additional Emission Sources'!E$16:E$25)","v":0},{"$f":"SUMIF($A$13:$A$23, RIGHT($B5, 1), D$13:D$23)+SUMIF('Additional Emission Sources'!$D$16:$D$25,  RIGHT($B5,1), 'Additional Emission Sources'!F$16:F$25)","v":0},{"$f":"SUMIF($A$13:$A$23, RIGHT($B5, 1), E$13:E$23)+SUMIF('Additional Emission Sources'!$D$16:$D$25,  RIGHT($B5,1), 'Additional Emission Sources'!G$16:G$25)","v":0},{"$f":"SUMIF('Additional Emission Sources'!$D$16:$D$25,  RIGHT($B5,1), 'Additional Emission Sources'!H$16:H$25)","v":0},{"$f":"SUMIF('Additional Emission Sources'!$D$16:$D$25,  RIGHT($B5,1), 'Additional Emission Sources'!I$16:I$25)","v":0},{"$f":"SUMIF('Additional Emission Sources'!$D$16:$D$25,  RIGHT($B5,1), 'Additional Emission Sources'!J$16:J$25)","v":0},{"$f":"SUM(C5:H5)","v":0},{"$f":"IF($I$8=0,0,I5/$I$8)","v":0}]
[null,"Scope 2",{"$f":"SUMIF($A$13:$A$23, RIGHT($B6, 1), C$13:C$23)+SUMIF('Additional Emission Sources'!$D$16:$D$25,  RIGHT($B6,1), 'Additional Emission Sources'!E$16:E$25)","v":0},{"$f":"SUMIF($A$13:$A$23, RIGHT($B6, 1), D$13:D$23)+SUMIF('Additional Emission Sources'!$D$16:$D$25,  RIGHT($B6,1), 'Additional Emission Sources'!F$16:F$25)","v":0},{"$f":"SUMIF($A$13:$A$23, RIGHT($B6, 1), E$13:E$23)+SUMIF('Additional Emission Sources'!$D$16:$D$25,  RIGHT($B6,1), 'Additional Emission Sources'!G$16:G$25)","v":0},{"$f":"SUMIF('Additional Emission Sources'!$D$16:$D$25,  RIGHT($B6,1), 'Additional Emission Sources'!H$16:H$25)","v":0},{"$f":"SUMIF('Additional Emission Sources'!$D$16:$D$25,  RIGHT($B6,1), 'Additional Emission Sources'!I$16:I$25)","v":0},{"$f":"SUMIF('Additional Emission Sources'!$D$16:$D$25,  RIGHT($B6,1), 'Additional Emission Sources'!J$16:J$25)","v":0},{"$f":"SUM(C6:H6)","v":0},{"$f":"IF($I$8=0,0,I6/$I$8)","v":0}]
[null,"Scope 3",{"$f":"SUMIF($A$13:$A$23, RIGHT($B7, 1), C$13:C$23)+SUMIF('Additional Emission Sources'!$D$16:$D$25,  RIGHT($B7,1), 'Additional Emission Sources'!E$16:E$25)","v":0},{"$f":"SUMIF($A$13:$A$23, RIGHT($B7, 1), D$13:D$23)+SUMIF('Additional Emission Sources'!$D$16:$D$25,  RIGHT($B7,1), 'Additional Emission Sources'!F$16:F$25)","v":0},{"$f":"SUMIF($A$13:$A$23, RIGHT($B7, 1), E$13:E$23)+SUMIF('Additional Emission Sources'!$D$16:$D$25,  RIGHT($B7,1), 'Additional Emission Sources'!G$16:G$25)","v":0},{"$f":"SUMIF('Additional Emission Sources'!$D$16:$D$25,  RIGHT($B7,1), 'Additional Emission Sources'!H$16:H$25)","v":0},{"$f":"SUMIF('Additional Emission Sources'!$D$16:$D$25,  RIGHT($B7,1), 'Additional Emission Sources'!I$16:I$25)","v":0},{"$f":"SUMIF('Additional Emission Sources'!$D$16:$D$25,  RIGHT($B7,1), 'Additional Emission Sources'!J$16:J$25)","v":0},0,{"$f":"IF($I$8=0,0,I7/$I$8)","v":0}]
[null,"Total Gross Emissions",{"$f":"SUM(C5:C6)+ SUMIF($A$13:$A$20, RIGHT($B7, 1), C$13:C$20)+SUMIF($A$22, RIGHT($B7, 1), C$22)+SUMIF('Additional Emission Sources'!$D$16:$D$25,  RIGHT($B7,1), 'Additional Emission Sources'!E$16:E$25)","v":0},{"$f":"SUM(D5:D7)","v":0},0,0,0,0,{"$f":"SUM(C8:E8)","v":0},{"$f":"SUM(J5:J7)","v":0}]
{"$rows_left_out":144}
{"sheet":"Factors","index":31,"n_rows":332,"n_cols":29,"rows_kept":332,"cut":false,"hidden":false,"merged":[[315,0,315,15],[40,6,40,7],[274,0,274,13],[147,0,147,15],[299,0,299,1],[41,6,41,7],[42,6,42,7],[50,6,50,7],[51,6,51,7],[285,6,285,8],[286,6,286,8],[287,6,287,8],[288,6,288,8],[289,6,289,8],[290,6,290,8]]}
["Factors"]
[]
["Unit Conversion Factors"]
[null,null,"Multiply by"]
[null,"kWh to MWh",{"$f":"1/1000","v":1E-3},null,null,null,"Legend:"]
[null,"lbs to metric tons",4.5359236999999999E-4,null,null,null,"Hard-wired factor"]
[null,"kg to metric tons",{"$f":"0.001","v":1E-3},null,null,null,"Calculated factor"]
[null,"g to kg",1E-3]
{"$rows_left_out":325}
{"sheet":"Background Controls","index":32,"n_rows":68,"n_cols":21,"rows_kept":68,"cut":false,"hidden":true,"merged":[]}
["Background Controls"]
[null,null,null,null,null,null,null,null,"Lists"]
[null,null,null,null,null,null,null,null,{"$f":"MyDepartmentCount","v":1}]
["Tool Name","Local Inventory Tool",null,null,null,null,null,null,"Department","Landfills",null,null,null,"Stationary Fuels","Facility Types","Water Importers","Comprehensive/Partial","Yes/No","Scope",null,"Emission Factors Choice"]
["Version Number",1,null,null,null,null,null,null,{"$f":"'Control Sheet'!D16","v":0},{"$f":"'Solid Waste-Control'!C28","v":0},null,null,null,"Natural Gas","Office Building","SWP west branch",null,null,1,null,true]
[null,null,null,null,null,null,null,null,{"$f":"'Control Sheet'!D17","v":0},{"$f":"'Solid Waste-Control'!C29","v":0},null,null,null,"Diesel","Warehouse","SWP east branch","Comprehensive","Yes",2,null,true]
[null,null,null,null,null,null,null,null,{"$f":"'Control Sheet'!D18","v":0},{"$f":"'Solid Waste-Control'!C30","v":0},null,null,null,"Gasoline","Water Infrastructure","MWD west branch","Partial","No",3,null,true]
[null,null,null,null,null,null,null,null,{"$f":"'Control Sheet'!D19","v":0},{"$f":"'Solid Waste-Control'!C31","v":0},null,null,null,"LPG","Wastewater Infrastructure","MWD east branch","N/A",null,null,null,true]
{"$rows_left_out":61}
{"sheet":"Help","index":33,"n_rows":1,"n_cols":1,"rows_kept":1,"cut":false,"hidden":true,"merged":[]}
["Help"]

{"sheet":"Detail Type Data","index":34,"n_rows":94,"n_cols":36,"rows_kept":94,"cut":false,"hidden":true,"merged":[[28,3,28,5],[29,9,29,12]]}
[]
[null,"Stationary Fuel Combustion Energy Use (MMBtu)"]
[null,null,"Natural Gas","Diesel","Gasoline","LPG","Propane","Butane","Residual Fuel Oil No. 5","Residual Fuel Oil No. 6","Jet Fuel","Bituminous Coal","Digester Gas","Total"]
[null,null,{"$f":"VLOOKUP(C3, stat_factors, 5, FALSE)","v":1.028},0.13800000000000001,0.125,9.1999999999999998E-2,9.0999999999999998E-2,0.10100000000000001,0.14000000000000001,0.15,0.13500000000000001,24.93,0.84099999999999997]
[null,{"$f":"'Background Controls'!O5","v":"Office Building"},{"$f":"SUMIFS(stat_data_consump, stat_data_bldgtype, $B5, stat_data_FuelType, C$3)*C$4","v":0},0,0,0,0,0,0,0,0,0,0,{"$f":"SUM(C5:M5)","v":0}]
[null,{"$f":"'Background Controls'!O6","v":"Warehouse"},0,0,0,0,0,0,0,0,0,0,0,{"$f":"SUM(C6:M6)","v":0}]
[null,{"$f":"'Background Controls'!O7","v":"Water Infrastructure"},0,0,0,0,0,0,0,0,0,0,0,0]
[null,{"$f":"'Background Controls'!O8","v":"Wastewater Infrastructure"},0,0,0,0,0,0,0,0,0,0,0,0]
{"$rows_left_out":87}
{"sheet":"Notes","index":35,"n_rows":1,"n_cols":1,"rows_kept":1,"cut":false,"hidden":false,"merged":[]}
["Notes"]