{"text_format":"1","workbook":"xlsx","n_sheets":36,"sheets":["Introduction","Read Me","TOC","Definitions","Control Sheet","CompletionTracker","Stationary-Entry","StatTemplateReadMe","Stationary-Data","Stationary-Calcs","ElecTemplateReadMe","Mobile-Entry","Mobile-Data","MobTemplateReadMe","Mobile-Summary","Mobile-Detail Calcs","Solid Waste-Control","Solid Waste-Entry","Wastewater-Control","Wastewater-Entry","Wastewater- Calcs","Electricity-Entry","Electricity-Data","Electricity-Calcs","Employee Commute","Water","Agriculture & Land Management","Urban Forestry","Waste Production","Additional Emission Sources","Summary-Emissions","Factors","Background Controls","Help","Detail Type Data","Notes"],"not_rendered":{"charts":25,"images":32,"macros":1,"external_links":0,"defined_names":350,"comments":1,"pivot_tables":0},"unopened":[],"bounds":{"document_bytes":16777216,"sheet_cells":100000,"rows_first":2000,"rows_last":500,"rows_between":2000,"halvings":0,"cell_chars":16384,"cell_head_chars":4096},"cells_cut":0,"cells_raw":0,"read":"whole","date_system":"1900"}

{"sheet":"Introduction","index":0,"n_rows":36,"n_cols":1,"rows_kept":36,"cut":false,"hidden":false,"merged":[[35,0,35,12]]}
["Introduction"]
[]
[]
[]
[]
[]
[]
[]
[]
[]
[]
[]
[]
[]
[]
[]
[]
[]
[]
[]
[]
[]
[]
[]
[]
[]
[]
[]
[]
[]
[]
[]
[]
[]
[]
["Tribal GHG Inventory Tool: Government Operations Module"]

{"sheet":"Read Me","index":1,"n_rows":69,"n_cols":1,"rows_kept":69,"cut":false,"hidden":false,"merged":[[68,0,68,19]]}
["Read Me"]
[]
[]
[]
[]
[]
[]
[]
[]
[]
[]
[]
[]
[]
[]
[]
[]
[]
[]
[]
[]
[]
[]
[]
[]
[]
[]
[]
[]
[]
[]
[]
[]
[]
[]
[]
[]
[]
[]
[]
[]
[]
[]
[]
[]
[]
[]
[]
[]
[]
[]
[]
[]
[]
[]
[]
[]
[]
[]
[]
[]
[]
[]
[]
[]
[]
[]
[]
["Tribal GHG Inventory Tool: Government Operations Module\n"]

{"sheet":"TOC","index":2,"n_rows":42,"n_cols":1,"rows_kept":42,"cut":false,"hidden":false,"merged":[[41,0,41,21]]}
["Table of Contents"]
[]
[]
[]
[]
[]
[]
[]
[]
[]
[]
[]
[]
[]
[]
[]
[]
[]
[]
[]
[]
[]
[]
[]
[]
[]
[]
[]
[]
[]
[]
[]
[]
[]
[]
[]
[]
[]
[]
[]
[]
["Tribal GHG Inventory Tool: Government Operations Module"]

{"sheet":"Definitions","index":3,"n_rows":47,"n_cols":3,"rows_kept":47,"cut":false,"hidden":false,"merged":[[46,0,46,8]]}
["Definitions"]
[]
[null,"Please refer to this list for an explanation of any terms you may find within this tool."]
[]
[null,"Term","Definition"]
[null,"Base Year","A measurement, calculation, or time used as a basis for comparison. According to LGOP, it is good practice to aim for a base year that is likely to be representative of the general level of emissions over the surrounding period."]
[null,"BAU","Business As Usual. Used to refer to a future scenario in which there are no changes to the status quo."]
[null,"Biogenic","Biogenic emissions or fuels are produced by the biological processes of living organisms. Note that this term refers only to recently produced (i.e., non-fossil) material of biological origin"]
[null,"BOD5","Biological Oxygen Demand. The amount of oxygen consumed in five days by decomposing waste, used to measure the amount of waste input or output into a system."]
[null,"CO2","carbon dioxide"]
[null,"CO2e","Carbon dioxide equivalent emissions. This is determined by multiplying the emissions of methane and nitrous oxide by their Global Warming Potential."]
[null,"CH4","Methane. Methane is a greenhouse gas with a GWP that is 21 times that of CO2.  It is produced through anaerobic decomposition of waste, enteric fermentation, production of natural gas and petroleum products, and other industrial processes."]
[null,"Denitrification","The process by which microorganisms remove nitrogen from its fixed form in the soil and release it into the atmosphere in the form of nitrous oxide (N2O)"]
[null,"Direct Emissions","The emissions generated on-site (as opposed to electricity delivered through a grid system), such as from the combustion of fossil fuels"]
[null,"EF","Emission Factor. The value for scaling emissions to activity data in terms of a standard rate of emissions per unit of activity (e.g., grams of carbon dioxide emitted per barrel of fossil fuel consumed)."]
[null,"Effluent","The treated or untreated wastewater that flows out of a source"]
[null,"EPA","United States Environmental Protection Agency"]
[null,"Fossil Fuel","Any fuel derived from the pre-historic burial of organic matter.  Examples include natural gas (methane or CH4) and petroleum products (gasoline, diesel, kerosene, propane, and others).  Combustion of petroleum products releases greenhouse gases into the atmosphere."]
[null,"Fugitive Emissions","Emissions of gases that escape from pressurized equipment, such as fuel transportation pipelines or wastewater treatment plants."]
[null,"G.G.E.","Gallon of gasoline equivalent"]
[null,"GHG","greenhouse gas"]
[null,"GWP","Global Warming Potential. Conversion factor used to compare all greenhouse gas emissions to carbon dioxide equivalent units. The GWP represents the combined effect of the differing times these gases remain in the atmosphere and their relative effectiveness in absorbing outgoing thermal infrared radiation."]
[null,"Indirect Emissions","Emissions that can be allocated in an inventory to an entity, but that are generate offsite.  An example is electricity that is not generated directly at a facility. A facility uses electricity on-site, but the fuels used to generate the electricity are combusted off-site, perhaps at a regional power plant."]
[null,"kg","kilograms"]
[null,"kWh","kilowatt-hour"]
[null,"LEED","Leadership in Energy and Environmental Design "]
[null,"LFG","landfill gas"]
[null,"LGOP","Local Government Operations Protocol"]
[null,"mcf","thousand cubic feet of natural gas"]
[null,"MG","million gallons"]
[null,"MMBtu","million British Thermal Units, a measure of energy"]
[null,"Mobile Combustion","The combustion of fuels to power a moving vehicle, such as gasoline or diesel fuel in a car or truck"]
[null,"MT CO2e","Metric tons of carbon dioxide equivalent. This is the standard unit for measuring greenhouse gas emissions."]
[null,"N2O","nitrous oxide"]
[null,"Nitrification","Biological process in which ammonia is converted to nitrate (NO3)."]
[null,"Operational Control","A local/tribal government has operational control over an operation if it has the full authority to introduce and implement its operating procedures"]
[null,"RPS","Renewable Portfolio Standard"]
[null,"Scope 1 Emissions","All direct GHG emissions"]
[null,"Scope 2 Emissions","Indirect GHG emissions from the consumption of purchased electricity, heat, or steam."]
[null,"Scope 3 Emissions","Other indirect emissions, such as the extraction and production of purchased materials and fuels, transport-related activities in vehicles not owned or controlled by the reporting entity, outsourced activities, etc. The Scope 3 emissions included in this inventory are employee commutes, imported water consumption,  waste generation, urban forestry, and agriculture & land management."]
[null,"Short Tons","American ton, equal to 2,000 lbs. One short ton = 0.907 metric tons"]
[null,"Stationary Combustion","The on-site combustion of fuels to produce electricity, heat, or motive power using equipment in a fixed location"]
[]
[]
[]
[]
["Tribal GHG Inventory Tool: Government Operations Module"]

{"sheet":"Control Sheet","index":4,"n_rows":91,"n_cols":8,"rows_kept":91,"cut":false,"hidden":false,"merged":[[41,4,41,6],[39,1,39,12],[8,1,8,7],[90,0,90,13],[43,1,43,2],[37,0,37,7]]}
["Inventory Control Sheet"]
["Complete the 5 steps below to set up the tool for your tribe."]
["1) Please enter the name of your tribe, the inventory year, and population below."]
[]
[null,"Tribe"]
[null,"Year"]
[null,"Population"]
["2) Please specify the number of departments in your tribe here by using the button to the right of the input cell below."]
[null,"You should configure the departments based on the type of data you have available and at what scale. Departments do not need to correspond to every department within the tribe, but should be set up to reflect organizational units for which the most comprehensive data is available. For example, if you have tribal-wide data, you may set up only one department, \"tribe.\" Alternatively, if you have data broken down by billing units which are different from tribal departments, you may name the \"Departments\" after those units. You must enter a minimum of 1 department in this step."]
[null,"The maximum number of departments is 20. The minimum is 1."]
[]
[null,null,null,1]
[]
["3) Next, please enter the names of each department here. "]
[]
["Dstart",null,1]
[null,null,2]
[null,null,3]
[null,null,4]
[null,null,5]
[null,null,6]
[null,null,7]
[null,null,8]
[null,null,9]
[null,null,10]
[null,null,11]
[null,null,12]
[null,null,13]
[null,null,14]
[null,null,15]
[null,null,16]
[null,null,17]
[null,null,18]
[null,null,19]
[null,null,20]
[]
[]
["4) Select the eGRID subregion where your tribe is located and enter utility-specific emissions factors, if available, for the utilities that provide electric service for your tribal government operations."]
[null,"These utility selections and emission factors will be used to help calculate your emissions throughout the tool."]
[null,"See the map below the table to identify the eGRID subregion that includes your community and continue to Step 5 below "]
[null,"once this table is complete."]
[null,null,null,null,"Emission Factors (lb/MWh)",null,null,"Total EF "]
[null,null,null,"Select eGRID Subregion…","CO2","CH4","N2O","lb CO2e/MWh"]
[null,"Select your subregion:",null,null,{"$f":"IFERROR(VLOOKUP(D44, elec_factors_CO2, elec_colindex_MyYear+1, FALSE),\"\")","v":""},{"$f":"IFERROR(VLOOKUP(D44, elec_factors_CH4, elec_colindex_MyYear+1, FALSE),\"\")","v":""},{"$f":"IFERROR(VLOOKUP(D44, elec_factors_N2O, elec_colindex_MyYear+1, FALSE),\"\")","v":""},{"$f":"IFERROR(E44*CO2_CO2e+F44*CH4_CO2e+G44*N2O_CO2e,\"\")","v":""}]
[null,null,null,"Utility Name"]
[null,false,null,null,null,null,null,{"$f":"E46*CO2_CO2e+F46*CH4_CO2e+G46*N2O_CO2e","v":0}]
[null,false,null,null,null,null,null,0]
[null,false,null,null,null,null,null,0]
[null,false,null,null,null,null,null,0]
[null,false,null,null,null,null,null,0]
[]
[]
[]
[]
[]
[]
[]
[]
[]
[]
[]
[]
[]
[]
[]
[]
[]
[]
[]
[]
[]
[]
[]
[]
[]
[]
[]
[]
[]
[]
[]
["5) Finally, please click on the \"Set Up\" button below."]
[null,"This will set up each sheet based on your entries above. You can always come back and add a department or change an emission factor."]
[null,"However, please do not edit or delete department names after you have run the Set Up process below."]
[]
[]
[]
[]
[]
[]
["Tribal GHG Inventory Tool: Government Operations Module"]

{"sheet":"CompletionTracker","index":5,"n_rows":24,"n_cols":2,"rows_kept":24,"cut":false,"hidden":true,"merged":[]}
["CompletionTracker"]
[]
[]
["Control Sheet",false]
["Stationary-Entry",false]
["Stationary-Data",false]
["Electricity-Entry",false]
["Electricity-Data",false]
["Mobile-Entry",false]
["Mobile-Data",false]
["Solid Waste-Control",false]
["Solid Waste-Entry",false]
["Wastewater-Control",false]
["Wastewater-Entry",false]
["Employee Commutes",false]
["Water",false]
["Agriculture & Land Management",false]
["Urban Forestry",false]
["Waste Production",false]
["Additional Emission Sources",false]
["Summary-Emissions"]
["Summary-Reductions"]
["Background Controls"]
["Help"]

{"sheet":"Stationary-Entry","index":6,"n_rows":25,"n_cols":6,"rows_kept":25,"cut":false,"hidden":false,"merged":[[24,0,24,5]]}
["Stationary Combustion - Entry"]
["Data Entry & Calculations"]
[]
[]
[]
[]
["1)","Describe the fuel consuming unit you are entering"]
[null,"ID#","Unit Description","Facility Type (if applicable)","Department"]
[0,{"$f":"stat_CurrentID","v":1}]
[]
[]
["2) ",{"$f":"\"Enter the activity data for the year \"&MyYear","v":"Enter the activity data for the year "}]
[]
[null,"Fuel Type",{"$f":"IF(ISNA(\"Fuel Use (\"&VLOOKUP(stat_entry_fuel,stat_factors,6,FALSE)&\"):\"),\"Fuel Use\",\"Fuel Use (\"&VLOOKUP(stat_entry_fuel,stat_factors,6,FALSE)&\"):\")","v":"Fuel Use"}]
[]
[]
[]
[null,null,null,null,null," "]
[]
[]
[]
[]
[]
[]
["Tribal GHG Inventory Tool: Government Operations Module"]

{"sheet":"StatTemplateReadMe","index":7,"n_rows":36,"n_cols":3,"rows_kept":36,"cut":false,"hidden":true,"merged":[[25,1,25,2],[0,1,0,2],[1,1,1,2],[2,1,2,2],[3,1,3,2],[23,1,23,2],[24,1,24,2],[4,1,4,2],[5,1,5,2],[6,1,6,2],[7,1,7,2],[8,1,8,2],[9,1,9,2]]}
["Stationary Data Template Instructions","This sheet describes the file layout and data parameters needed for batch import."]
[null,"This will allow you to bypass the data entry form and upload multiple lines of data."]
[null,"Please enter your activity data on the following worksheet (DataSheet) according to the parameters below."]
[null,"Copy and paste the data from that sheet onto the \"Stationary-Data\" worksheet in the inventory tool."]
["ID#","This value is automatically supplied when adding data via the input form. You will need to update this manually when using the batch import feature. Please assign a unique value to each line of data you add."]
[null,"Values must be integers in ascending order. Gaps between numbers are permitted. For example, three lines with IDs in order of 11, 12, and 15 are ok; IDs of 11, 15, and 12 is not. The calculations will not be accurate if the ID numbers do not meet this condition."]
[null,"It is recommended that you begin with the highest previous number and increase each additional line by 1."]
["Unit Description","Use this field to describe or name the unit or group that you are entering. This field is for the user's reference only and does not impact the calculations."]
["Department","Enter one of the departments that were specified on the Control Sheet. You must use the exact spelling of the department that was provided on the Control Sheet in order for each entry to be included in the calculations."]
["Fuel Type","Please enter the fuel type in this column. You must select the fuel type from the list below. Any other fuels will not be included in the calculations. The consumptions must also be in the units listed below."]
[]
[null,"Fuel","Unit"]
[null,"Natural Gas","mcf (thousand cubic feet)"]
[null,"Digester Gas","mcf (thousand cubic feet)"]
[null,"Diesel","gallons"]
[null,"LPG","gallons"]
[null,"Gasoline","gallons"]
[null,"Residual Fuel Oil No. 5","gallons"]
[null,"Residual Fuel Oil No. 6","gallons"]
[null,"Propane","gallons"]
[null,"Butane","gallons"]
[null,"Jet Fuel","gallons"]
[null,"Bituminous Coal","short tons"]
["Amount Consumed","Please enter your fuel consumption for the inventory year here."]
["Unit","This value is for reference only and does not affect the calculations. However, please be sure to enter data using the units specified above."]
["Facility Type","If you have chosen to enter data at the facility level, please specify the type of facility from the list provided below. "]
[]
[null,"Facility Type List"]
[null,"Office Building"]
[null,"Warehouse"]
[null,"Water Infrastructure"]
[null,"Wastewater Infrastructure"]
[null,"Outdoor Lighting"]
[null,"School"]
[null,"Health"]
[null,"Other"]

{"sheet":"Stationary-Data","index":8,"n_rows":8,"n_cols":7,"rows_kept":8,"cut":false,"hidden":false,"merged":[]}
["Stationary Combustion - Data"]
[]
[]
[]
["Linker Row"]
["ID#","Unit Description","Department","Fuel Type","Amount Consumed","Unit","Facility Type"]
[{"$f":"MAX(A9:A65521)+1","v":1},{"$f":"stat_entry_description","v":0},{"$f":"stat_entry_dept","v":0},{"$f":"stat_entry_fuel","v":0},{"$f":"stat_entry_consumption","v":0},{"$f":"IF(ISNA(VLOOKUP(D7,stat_factors,6,FALSE)), \" \", VLOOKUP(D7, stat_factors, 6, FALSE))","v":" "},{"$f":"stat_entry_bldgtype","v":0}]
["Saved Data"]

{"sheet":"Stationary-Calcs","index":9,"n_rows":281,"n_cols":19,"rows_kept":281,"cut":false,"hidden":false,"merged":[[280,0,280,16],[20,1,20,5],[20,8,20,12],[72,1,72,5],[72,8,72,11],[85,8,85,10]]}
["Stationary Combustion - Calculation & Summary "]
["Jump to…"]
["Department Summary"]
["Emissions by Department"]
["Fuel and Energy Consumption by Department"]
["Fuel Summary"]
["Emissions by Fuel Type"]
["Fuel and Energy Consumption by Type"]
["Background Calculations"]
["CO2 emissions by fuel type"]
["CH4 emissions by fuel type"]
["N2O emissions by fuel type"]
["Activity data by department and fuel type"]
["CO2 emissions by department and fuel type"]
["CH4 emissions by department and fuel type"]
["N2O emissions by department and fuel type"]
["Energy use by department and fuel type"]
[]
["Department Summary"]
[]
[null,"Emissions by Department (MT CO2e)",null,null,null,null,null,null,"Fuel and Energy (MMBtu) Consumption by Department"]
[null,"Department","CO2","CH4","N2O","Total",null,null,"Department","mcf","gal","tons","Energy Use"]
["Dstart",{"$f":"'Background Controls'!I5","v":0},{"$f":"IF(ISNA(VLOOKUP($B23, stat_calcs_CO2_deptFT, 13, FALSE)),0,VLOOKUP($B23, stat_calcs_CO2_deptFT, 13, FALSE))","v":0},{"$f":"IF(ISNA(VLOOKUP($B23, stat_calcs_CH4_deptFT, 13, FALSE)),0,VLOOKUP($B23, stat_calcs_CH4_deptFT, 13, FALSE))","v":0},{"$f":"IF(ISNA(VLOOKUP($B23, stat_calcs_N2O_deptFT, 13, FALSE)),0,VLOOKUP($B23, stat_calcs_N2O_deptFT, 13, FALSE))","v":0},{"$f":"SUM(C23:E23)","v":0},null,null,{"$f":"B23","v":0},{"$f":"IF(ISNA(VLOOKUP($I23, stat_calcs_consump_deptFT, 13, FALSE)),0,VLOOKUP($I23, stat_calcs_consump_deptFT, 13, FALSE))","v":0},{"$f":"IF(ISNA(VLOOKUP($I23, stat_calcs_consump_deptFT, 14, FALSE)),0,VLOOKUP($I23, stat_calcs_consump_deptFT, 14, FALSE))","v":0},{"$f":"IF(ISNA(VLOOKUP($I23, stat_calcs_consump_deptFT, 15, FALSE)),0,VLOOKUP($I23, stat_calcs_consump_deptFT, 15, FALSE))","v":0},{"$f":"IF(ISNA(VLOOKUP($I23, stat_calcs_E_deptFT, 13, FALSE)),0,VLOOKUP($I23, stat_calcs_E_deptFT, 13, FALSE))","v":0}]
[null,{"$f":"'Background Controls'!I6","v":0},{"$f":"IF(ISNA(VLOOKUP($B24, stat_calcs_CO2_deptFT, 13, FALSE)),0,VLOOKUP($B24, stat_calcs_CO2_deptFT, 13, FALSE))","v":0},0,0,{"$f":"SUM(C24:E24)","v":0},null,null,{"$f":"B24","v":0},0,0,0,0]
[null,{"$f":"'Background Controls'!I7","v":0},0,0,0,0,null,null,0,0,0,0,0]
[null,{"$f":"'Background Controls'!I8","v":0},0,0,0,0,null,null,0,0,0,0,0]
[null,{"$f":"'Background Controls'!I9","v":0},0,0,0,0,null,null,0,0,0,0,0]
[null,{"$f":"'Background Controls'!I10","v":0},0,0,0,0,null,null,0,0,0,0,0]
[null,{"$f":"'Background Controls'!I11","v":0},0,0,0,0,null,null,0,0,0,0,0]
[null,{"$f":"'Background Controls'!I12","v":0},0,0,0,0,null,null,0,0,0,0,0]
[null,{"$f":"'Background Controls'!I13","v":0},0,0,0,0,null,null,0,0,0,0,0]
[null,{"$f":"'Background Controls'!I14","v":0},0,0,0,0,null,null,0,0,0,0,0]
[null,{"$f":"'Background Controls'!I15","v":0},0,0,0,0,null,null,0,0,0,0,0]
[null,{"$f":"'Background Controls'!I16","v":0},0,0,0,0,null,null,0,0,0,0,0]
[null,{"$f":"'Background Controls'!I17","v":0},0,0,0,0,null,null,0,0,0,0,0]
[null,{"$f":"'Background Controls'!I18","v":0},0,0,0,0,null,null,0,0,0,0,0]
[null,{"$f":"'Background Controls'!I19","v":0},0,0,0,0,null,null,0,0,0,0,0]
[null,{"$f":"'Background Controls'!I20","v":0},0,0,0,0,null,null,0,0,0,0,0]
[null,{"$f":"'Background Controls'!I21","v":0},0,0,0,0,null,null,0,0,0,0,0]
[null,{"$f":"'Background Controls'!I22","v":0},0,0,0,0,null,null,0,0,0,0,0]
[null,{"$f":"'Background Controls'!I23","v":0},0,0,0,0,null,null,0,0,0,0,0]
[null,{"$f":"'Background Controls'!I24","v":0},0,0,0,0,null,null,0,0,0,0,0]
[null,"Total Stationary Combustion Emissions",{"$f":"SUM(C23:C42)","v":0},{"$f":"SUM(D23:D42)","v":0},0,0,null,null,"Total Stationary Combustion Energy Use",{"$f":"SUM(J23:J42)","v":0},{"$f":"SUM(K23:K42)","v":0},0,0]
[]
[]
[null,"Check to display: ",null,null,null,null,null,null,null,null,null,null,null,null,null,null,null,"emissions",true]
[null,null,null,null,null,null,null,null,null,null,null,null,null,null,null,null,null,"energy",true]
[null,null,null,null,null,null,null,null,null,null,null,null,null,null,null,null,null,"both",{"$f":"AND(S46:S47)","v":true}]
[null,null,null,null,null,null,null,null,null,null,null,null,null,null,null,null,null,null,{"$f":"IF(S48=TRUE, R48, IF(S46=TRUE, R46, IF(S47=TRUE, R47,\"both\")))","v":"both"}]
[]
[]
[]
[]
[]
[]
[]
[]
[]
[]
[]
[]
[]
[]
[]
[]
[]
[]
[]
[]
[]
["Fuel Summary"]
[]
[null,"Emissions by Fuel Type",null,null,null,null,null,null,"Fuel and Energy Consumption by Type"]
[null,"Fuel Type","CO2","CH4","N2O","TOTAL",null,null,"Fuel Type","Fuel Consumed",null,"Energy Use (MMBtu)"]
[null,"Natural Gas",{"$f":"VLOOKUP($B75, stat_calcs_CO2byFuel, 8, FALSE)","v":0},{"$f":"VLOOKUP($B75, stat_calcs_CH4byFuel, 8, FALSE)","v":0},{"$f":"VLOOKUP($B75, stat_calcs_N2ObyFuel, 8, FALSE)","v":0},{"$f":"SUM(C75:E75)","v":0},null,null,"Natural Gas",{"$f":"SUMIF(stat_data_FuelType, I75, stat_data_consump)","v":0},"mcf",{"$f":"HLOOKUP(I75, stat_calcs_E_deptFT, 22, FALSE)","v":0}]
[null,"Diesel",0,0,0,{"$f":"SUM(C76:E76)","v":0},null,null,"Diesel",0,"gal",0]
[null,"Gasoline",0,0,0,0,null,null,"Gasoline",0,"gal",0]
[null,"LPG",0,0,0,0,null,null,"LPG",0,"gal",0]
[null,"Propane",0,0,0,0,null,null,"Propane",0,"gal",0]
[null,"Butane",0,0,0,0,null,null,"Butane",0,"gal",0]
[null,"Residual Fuel Oil No. 5",0,0,0,0,null,null,"Residual Fuel Oil No. 5",0,"gal",0]
[null,"Residual Fuel Oil No. 6",0,0,0,0,null,null,"Residual Fuel Oil No. 6",0,"gal",0]
[null,"Jet Fuel",0,0,0,0,null,null,"Jet Fuel",0,"gal",0]
[null,"Bituminous Coal",0,0,0,0,null,null,"Bituminous Coal",0,"tons",0]
[null,"Digester Gas",0,0,0,{"$f":"SUM(C85:E85)","v":0},null,null,"Digester Gas",0,"mcf",0]
[null,"Total Emissions from Stationary Fuel Combustion",{"$f":"SUM(C75:C84)","v":0},{"$f":"SUM(D75:D84)","v":0},0,0,null,null,"Total Stationary Fuel Consumed",null,null,{"$f":"SUM(L75:L85)","v":0}]
[]
[null,"Check to display: ",null,null,null,null,null,null,null,null,null,null,null,null,null,null,null,"emissions",true]
[null,null,null,null,null,null,null,null,null,null,null,null,null,null,null,null,null,"energy",true]
[null,null,null,null,null,null,null,null,null,null,null,null,null,null,null,null,null,"both",{"$f":"AND(S88:S89)","v":true}]
[null,null,null,null,null,null,null,null,null,null,null,null,null,null,null,null,null,null,{"$f":"IF(S90=TRUE, R90, IF(S88=TRUE, R88, IF(S89=TRUE, R89, \"both\")))","v":"both"}]
[]
[]
[]
[]
[]
[]
[]
[]
[]
[]
[]
[]
[]
[]
[]
[]
["Background Calculations"]
[]
["CO2 Emissions by Fuel Type"]
["CO2 Emissions = Fuel use × CO2 Emission Factor (kg CO2/unit of fuel) × MT/kg"]
[null,null,"Fuel Use","Unit","kg CO2/unit ","MT/kg","MT CO2","× GWP =","MT CO2e"]
[null,"Natural Gas",{"$f":"SUMIF(stat_data_FuelType, B113, stat_data_consump)","v":0},"mcf",{"$f":"VLOOKUP(B113, stat_factors, 2, FALSE)","v":54.504560000000005},{"$f":"kg_mt","v":1E-3},{"$f":"C113*E113*F113","v":0},{"$f":"CO2_CO2e","v":1},{"$f":"G113*H113","v":0}]
[null,"Diesel",0,"gal",10.210000000000001,1E-3,0,1,{"$f":"G114*H114","v":0}]
[null,"Gasoline",0,"gal",8.7799999999999994,1E-3,0,1,0]
[null,"LPG",0,"gal",5.79,1E-3,0,1,0]
[null,"Propane",0,"gal",5.59,1E-3,0,1,0]
[null,"Butane",0,"gal",6.58,1E-3,0,1,0]
[null,"Residual Fuel Oil No. 5",0,"gal",10.210000000000001,1E-3,0,1,0]
[null,"Residual Fuel Oil No. 6",0,"gal",11.27,1E-3,0,1,0]
[null,"Jet Fuel",0,"gal",9.7497000000000007,1E-3,0,1,0]
[null,"Bituminous Coal",0,"tons",2328.462,1E-3,0,1,0]
[null,"Digester Gas",0,"mcf",43.790869999999998,1E-3,0,1,{"$f":"G123*H123","v":0}]
[]
["CH4 Emissions by Fuel Type"]
["CH4 Emissions = Fuel use × CH4 Emission Factor (kg CH4/unit of fuel) × MT/kg; CO2 equivalent emissions = MT CH4 × Global Warming Potential of CH4"]
[null,null,"Fuel Use","Unit","kg CH4/unit ","MT/kg","MT CH4","× GWP =","MT CO2e"]
[null,"Natural Gas",{"$f":"SUMIF(stat_data_FuelType, B128, stat_data_consump)","v":0},"mcf",{"$f":"VLOOKUP(B128, stat_factors, 3, FALSE)","v":5.1400000000000005E-3},{"$f":"kg_mt","v":1E-3},{"$f":"C128*E128*F128","v":0},{"$f":"CH4_CO2e","v":21},{"$f":"G128*H128","v":0}]
[null,"Diesel",0,"gal",1.5E-3,1E-3,0,21,{"$f":"G129*H129","v":0}]
[null,"Gasoline",0,"gal",1.4E-3,1E-3,0,21,0]
[null,"LPG",0,"gal",1E-3,1E-3,0,21,0]
[null,"Propane",0,"gal",1E-3,1E-3,0,21,0]
[null,"Butane",0,"gal",1.1000000000000001E-3,1E-3,0,21,0]
[null,"Residual Fuel Oil No. 5",0,"gal",1.5E-3,1E-3,0,21,0]
[null,"Residual Fuel Oil No. 6",0,"gal",1.6999999999999999E-3,1E-3,0,21,0]
[null,"Jet Fuel",0,"gal",1.485E-3,1E-3,0,21,0]
[null,"Bituminous Coal",0,"tons",0.27422999999999997,1E-3,0,21,0]
[null,"Digester Gas",0,"mcf",2.6911999999999999E-3,1E-3,0,21,{"$f":"G138*H138","v":0}]
[]
["N2O Emissions by Fuel Type"]
["N2O Emissions = Fuel use × N2O Emission Factor (kg N2O/unit of fuel) × MT/kg; CO2 equivalent emissions = MT N2O × Global Warming Potential of N2O"]
[null,null,"Fuel Use","Unit","kg N2O/unit","MT/kg","MT N2O","× GWP =","MT CO2e"]
[null,"Natural Gas",{"$f":"SUMIF(stat_data_FuelType, B143, stat_data_consump)","v":0},"mcf",{"$f":"VLOOKUP(B143, stat_factors, 4, FALSE)","v":1.0280000000000001E-4},{"$f":"kg_mt","v":1E-3},{"$f":"C143*E143*F143","v":0},{"$f":"N2O_CO2e","v":310},{"$f":"G143*H143","v":0}]
[null,"Diesel",0,"gal",1E-4,1E-3,0,310,{"$f":"G144*H144","v":0}]
[null,"Gasoline",0,"gal",1E-4,1E-3,0,310,0]
[null,"LPG",0,"gal",1E-4,1E-3,0,310,0]
[null,"Propane",0,"gal",1E-4,1E-3,0,310,0]
[null,"Butane",0,"gal",1E-4,1E-3,0,310,0]
[null,"Residual Fuel Oil No. 5",0,"gal",1E-4,1E-3,0,310,0]
[null,"Residual Fuel Oil No. 6",0,"gal",1E-4,1E-3,0,310,0]
[null,"Jet Fuel",0,"gal",8.1000000000000004E-5,1E-3,0,310,0]
[null,"Bituminous Coal",0,"tons",3.9888E-2,1E-3,0,310,0]
[null,"Digester Gas",0,"mcf",5.2983000000000001E-4,1E-3,0,310,{"$f":"G153*H153","v":0}]
[]
["Activity Data by Department and Fuel Type"]
["Fuel use data by department and fuel type. Units: Natural Gas and Digester Gas (mcf), Bituminous Coal (short tons), all other (gallons)"]
[null,null,{"$f":"TRANSPOSE($B$143:$B$152)","v":"Natural Gas"},"Diesel","Gasoline","LPG","Propane","Butane","Residual Fuel Oil No. 5","Residual Fuel Oil No. 6","Jet Fuel","Bituminous Coal","Digester Gas","Gas Products (mcf)","Petroleum Products (gal)","Coal (tons)"]
["Dstart",{"$f":"B23","v":0},{"$f":"SUMIFS(stat_data_consump, stat_data_dept, $B158, stat_data_FuelType, C$157)","v":0},0,0,0,0,0,0,0,0,0,0,{"$f":"SUM(C158,M158)","v":0},{"$f":"SUM(D158:K158)","v":0},{"$f":"L158","v":0}]
[null,{"$f":"B24","v":0},0,0,0,0,0,0,0,0,0,0,0,{"$f":"SUM(C159,M159)","v":0},{"$f":"SUM(D159:K159)","v":0},{"$f":"L159","v":0}]
[null,0,0,0,0,0,0,0,0,0,0,0,0,0,0,0]
[null,0,0,0,0,0,0,0,0,0,0,0,0,0,0,0]
[null,0,0,0,0,0,0,0,0,0,0,0,0,0,0,0]
[null,0,0,0,0,0,0,0,0,0,0,0,0,0,0,0]
[null,0,0,0,0,0,0,0,0,0,0,0,0,0,0,0]
[null,0,0,0,0,0,0,0,0,0,0,0,0,0,0,0]
[null,0,0,0,0,0,0,0,0,0,0,0,0,0,0,0]
[null,0,0,0,0,0,0,0,0,0,0,0,0,0,0,0]
[null,0,{"$f":"SUMIFS(stat_data_consump, stat_data_dept, $B168, stat_data_FuelType, C$157)","v":0},0,0,0,0,0,0,0,0,0,0,0,0,0]
[null,0,0,0,0,0,0,0,0,0,0,0,0,0,0,0]
[null,0,0,0,0,0,0,0,0,0,0,0,0,0,0,0]
[null,0,0,0,0,0,0,0,0,0,0,0,0,0,0,0]
[null,0,0,0,0,0,0,0,0,0,0,0,0,0,0,0]
[null,0,0,0,0,0,0,0,0,0,0,0,0,0,0,0]
[null,0,0,0,0,0,0,0,0,0,0,0,0,0,0,0]
[null,0,0,0,0,0,0,0,0,0,0,0,0,0,0,0]
[null,0,0,0,0,0,0,0,0,0,0,0,0,0,0,0]
[null,0,0,0,0,0,0,0,0,0,0,0,0,0,0,0]
[null,"Total",{"$f":"SUM(C158:C177)","v":0},{"$f":"SUM(D158:D177)","v":0},{"$f":"SUM(E158:E177)","v":0},0,0,0,0,0,0,0,{"$f":"SUM(M158:M177)","v":0},{"$f":"SUM(C178,M178)","v":0}]
[]
["Emissions by Department and Fuel Type"]
[]
["CO2 Emissions = Units of Fuel Consumed × kg CH4 / unit × MT/kg × GWP CH4"]
[null,"CO2",{"$f":"TRANSPOSE($B$143:$B$152)","v":"Natural Gas"},"Diesel","Gasoline","LPG","Propane","Butane","Residual Fuel Oil No. 5","Residual Fuel Oil No. 6","Jet Fuel","Bituminous Coal","Digester Gas","TOTAL"]
["Dstart",{"$f":"B158","v":0},{"$f":"C158*kg_mt*VLOOKUP(C$183, stat_factors, 2, FALSE)","v":0},0,0,0,0,0,0,0,0,0,0,{"$f":"SUM(C184:M184)","v":0}]
[null,{"$f":"B159","v":0},{"$f":"C159*kg_mt*VLOOKUP(C$183, stat_factors, 2, FALSE)","v":0},0,0,0,0,0,0,0,0,0,0,{"$f":"SUM(C185:M185)","v":0}]
[null,0,{"$f":"C160*kg_mt*VLOOKUP(C$183, stat_factors, 2, FALSE)","v":0},0,0,0,0,0,0,0,0,0,0,0]
[null,0,{"$f":"C161*kg_mt*VLOOKUP(C$183, stat_factors, 2, FALSE)","v":0},0,0,0,0,0,0,0,0,0,0,0]
[null,0,{"$f":"C162*kg_mt*VLOOKUP(C$183, stat_factors, 2, FALSE)","v":0},0,0,0,0,0,0,0,0,0,0,0]
[null,0,{"$f":"C163*kg_mt*VLOOKUP(C$183, stat_factors, 2, FALSE)","v":0},0,0,0,0,0,0,0,0,0,0,0]
[null,0,{"$f":"C164*kg_mt*VLOOKUP(C$183, stat_factors, 2, FALSE)","v":0},0,0,0,0,0,0,0,0,0,0,0]
[null,0,{"$f":"C165*kg_mt*VLOOKUP(C$183, stat_factors, 2, FALSE)","v":0},0,0,0,0,0,0,0,0,0,0,0]
[null,0,{"$f":"C166*kg_mt*VLOOKUP(C$183, stat_factors, 2, FALSE)","v":0},0,0,0,0,0,0,0,0,0,0,0]
[null,0,{"$f":"C167*kg_mt*VLOOKUP(C$183, stat_factors, 2, FALSE)","v":0},0,0,0,0,0,0,0,0,0,0,0]
[null,0,{"$f":"C168*kg_mt*VLOOKUP(C$183, stat_factors, 2, FALSE)","v":0},0,0,0,0,0,0,0,0,0,0,0]
[null,0,{"$f":"C169*kg_mt*VLOOKUP(C$183, stat_factors, 2, FALSE)","v":0},0,0,0,0,0,0,0,0,0,0,0]
[null,0,{"$f":"C170*kg_mt*VLOOKUP(C$183, stat_factors, 2, FALSE)","v":0},0,0,0,0,0,0,0,0,0,0,0]
[null,0,{"$f":"C171*kg_mt*VLOOKUP(C$183, stat_factors, 2, FALSE)","v":0},0,0,0,0,0,0,0,0,0,0,0]
[null,0,{"$f":"C172*kg_mt*VLOOKUP(C$183, stat_factors, 2, FALSE)","v":0},0,0,0,0,0,0,0,0,0,0,0]
[null,0,{"$f":"C173*kg_mt*VLOOKUP(C$183, stat_factors, 2, FALSE)","v":0},0,0,0,0,0,0,0,0,0,0,0]
[null,0,{"$f":"C174*kg_mt*VLOOKUP(C$183, stat_factors, 2, FALSE)","v":0},0,0,0,0,0,0,0,0,0,0,0]
[null,0,{"$f":"C175*kg_mt*VLOOKUP(C$183, stat_factors, 2, FALSE)","v":0},0,0,0,0,0,0,0,0,0,0,0]
[null,0,{"$f":"C176*kg_mt*VLOOKUP(C$183, stat_factors, 2, FALSE)","v":0},0,0,0,0,0,0,0,0,0,0,0]
[null,0,{"$f":"C177*kg_mt*VLOOKUP(C$183, stat_factors, 2, FALSE)","v":0},0,0,0,0,0,0,0,0,0,0,0]
[null,"Total",{"$f":"SUM(C184:C203)","v":0},{"$f":"SUM(D184:D203)","v":0},0,0,0,0,0,0,0,0,0,{"$f":"SUM(N184:N188)","v":0}]
[]
["CH4 Emissions = Units of Fuel Consumed × kg CH4 / unit × MT/kg × GWP CH4"]
[null,"CH4",{"$f":"TRANSPOSE($B$143:$B$152)","v":"Natural Gas"},"Diesel","Gasoline","LPG","Propane","Butane","Residual Fuel Oil No. 5","Residual Fuel Oil No. 6","Jet Fuel","Bituminous Coal","Digester Gas","TOTAL"]
["Dstart",{"$f":"B184","v":0},{"$f":"C158*kg_mt*VLOOKUP(C$207, stat_factors, 3, FALSE)","v":0},0,0,0,0,0,0,0,0,0,0,{"$f":"SUM(C208:M208)","v":0}]
[null,{"$f":"B185","v":0},{"$f":"C159*kg_mt*VLOOKUP(C$207, stat_factors, 3, FALSE)","v":0},0,0,0,0,0,0,0,0,0,0,{"$f":"SUM(C209:M209)","v":0}]
[null,0,{"$f":"C160*kg_mt*VLOOKUP(C$207, stat_factors, 3, FALSE)","v":0},0,0,0,0,0,0,0,0,0,0,0]
[null,0,{"$f":"C161*kg_mt*VLOOKUP(C$207, stat_factors, 3, FALSE)","v":0},0,0,0,0,0,0,0,0,0,0,0]
[null,0,{"$f":"C162*kg_mt*VLOOKUP(C$207, stat_factors, 3, FALSE)","v":0},0,0,0,0,0,0,0,0,0,0,0]
[null,0,{"$f":"C163*kg_mt*VLOOKUP(C$207, stat_factors, 3, FALSE)","v":0},0,0,0,0,0,0,0,0,0,0,0]
[null,0,{"$f":"C164*kg_mt*VLOOKUP(C$207, stat_factors, 3, FALSE)","v":0},0,0,0,0,0,0,0,0,0,0,{"$f":"SUM(C214:M214)","v":0}]
[null,0,{"$f":"C165*kg_mt*VLOOKUP(C$207, stat_factors, 3, FALSE)","v":0},0,0,0,0,0,0,0,0,0,0,{"$f":"SUM(C215:M215)","v":0}]
[null,0,{"$f":"C166*kg_mt*VLOOKUP(C$207, stat_factors, 3, FALSE)","v":0},0,0,0,0,0,0,0,0,0,0,0]
[null,0,{"$f":"C167*kg_mt*VLOOKUP(C$207, stat_factors, 3, FALSE)","v":0},0,0,0,0,0,0,0,0,0,0,0]
[null,0,{"$f":"C168*kg_mt*VLOOKUP(C$207, stat_factors, 3, FALSE)","v":0},0,0,0,0,0,0,0,0,0,0,0]
[null,0,{"$f":"C169*kg_mt*VLOOKUP(C$207, stat_factors, 3, FALSE)","v":0},0,0,0,0,0,0,0,0,0,0,0]
[null,0,{"$f":"C170*kg_mt*VLOOKUP(C$207, stat_factors, 3, FALSE)","v":0},0,0,0,0,0,0,0,0,0,0,0]
[null,0,{"$f":"C171*kg_mt*VLOOKUP(C$207, stat_factors, 3, FALSE)","v":0},0,0,0,0,0,0,0,0,0,0,0]
[null,0,{"$f":"C172*kg_mt*VLOOKUP(C$207, stat_factors, 3, FALSE)","v":0},0,0,0,0,0,0,0,0,0,0,0]
[null,0,{"$f":"C173*kg_mt*VLOOKUP(C$207, stat_factors, 3, FALSE)","v":0},0,0,0,0,0,0,0,0,0,0,0]
[null,0,{"$f":"C174*kg_mt*VLOOKUP(C$207, stat_factors, 3, FALSE)","v":0},0,0,0,0,0,0,0,0,0,0,0]
[null,0,{"$f":"C175*kg_mt*VLOOKUP(C$207, stat_factors, 3, FALSE)","v":0},0,0,0,0,0,0,0,0,0,0,0]
[null,0,{"$f":"C176*kg_mt*VLOOKUP(C$207, stat_factors, 3, FALSE)","v":0},0,0,0,0,0,0,0,0,0,0,0]
[null,0,{"$f":"C177*kg_mt*VLOOKUP(C$207, stat_factors, 3, FALSE)","v":0},0,0,0,0,0,0,0,0,0,0,0]
[null,"Total",{"$f":"SUM(C208:C227)","v":0},{"$f":"SUM(D208:D227)","v":0},0,0,0,0,0,0,0,0,0,{"$f":"SUM(N208:N212)","v":0}]
[]
["N2O Emissions = Units of Fuel Consumed × kg N2O / unit × MT/kg × GWP N2O"]
[null,"N2O",{"$f":"TRANSPOSE($B$143:$B$152)","v":"Natural Gas"},"Diesel","Gasoline","LPG","Propane","Butane","Residual Fuel Oil No. 5","Residual Fuel Oil No. 6","Jet Fuel","Bituminous Coal","Digester Gas","TOTAL"]
["Dstart",{"$f":"B208","v":0},{"$f":"C158*kg_mt*VLOOKUP(C$231, stat_factors, 4, FALSE)","v":0},0,0,0,0,0,0,0,0,0,0,{"$f":"SUM(C232:M232)","v":0}]
[null,{"$f":"B209","v":0},{"$f":"C159*kg_mt*VLOOKUP(C$231, stat_factors, 4, FALSE)","v":0},0,0,0,0,0,0,0,0,0,0,{"$f":"SUM(C233:M233)","v":0}]
[null,0,{"$f":"C160*kg_mt*VLOOKUP(C$231, stat_factors, 4, FALSE)","v":0},0,0,0,0,0,0,0,0,0,0,0]
[null,0,{"$f":"C161*kg_mt*VLOOKUP(C$231, stat_factors, 4, FALSE)","v":0},0,0,0,0,0,0,0,0,0,0,0]
[null,0,{"$f":"C162*kg_mt*VLOOKUP(C$231, stat_factors, 4, FALSE)","v":0},0,0,0,0,0,0,0,0,0,0,0]
[null,0,{"$f":"C163*kg_mt*VLOOKUP(C$231, stat_factors, 4, FALSE)","v":0},0,0,0,0,0,0,0,0,0,0,0]
[null,0,{"$f":"C164*kg_mt*VLOOKUP(C$231, stat_factors, 4, FALSE)","v":0},0,0,0,0,0,0,0,0,0,0,0]
[null,0,{"$f":"C165*kg_mt*VLOOKUP(C$231, stat_factors, 4, FALSE)","v":0},0,0,0,0,0,0,0,0,0,0,0]
[null,0,{"$f":"C166*kg_mt*VLOOKUP(C$231, stat_factors, 4, FALSE)","v":0},0,0,0,0,0,0,0,0,0,0,0]
[null,0,{"$f":"C167*kg_mt*VLOOKUP(C$231, stat_factors, 4, FALSE)","v":0},0,0,0,0,0,0,0,0,0,0,0]
[null,0,{"$f":"C168*kg_mt*VLOOKUP(C$231, stat_factors, 4, FALSE)","v":0},0,0,0,0,0,0,0,0,0,0,0]
[null,0,{"$f":"C169*kg_mt*VLOOKUP(C$231, stat_factors, 4, FALSE)","v":0},0,0,0,0,0,0,0,0,0,0,0]
[null,0,{"$f":"C170*kg_mt*VLOOKUP(C$231, stat_factors, 4, FALSE)","v":0},0,0,0,0,0,0,0,0,0,0,0]
[null,0,{"$f":"C171*kg_mt*VLOOKUP(C$231, stat_factors, 4, FALSE)","v":0},0,0,0,0,0,0,0,0,0,0,0]
[null,0,{"$f":"C172*kg_mt*VLOOKUP(C$231, stat_factors, 4, FALSE)","v":0},0,0,0,0,0,0,0,0,0,0,0]
[null,0,{"$f":"C173*kg_mt*VLOOKUP(C$231, stat_factors, 4, FALSE)","v":0},0,0,0,0,0,0,0,0,0,0,0]
[null,0,{"$f":"C174*kg_mt*VLOOKUP(C$231, stat_factors, 4, FALSE)","v":0},0,0,0,0,0,0,0,0,0,0,0]
[null,0,{"$f":"C175*kg_mt*VLOOKUP(C$231, stat_factors, 4, FALSE)","v":0},0,0,0,0,0,0,0,0,0,0,0]
[null,0,{"$f":"C176*kg_mt*VLOOKUP(C$231, stat_factors, 4, FALSE)","v":0},0,0,0,0,0,0,0,0,0,0,0]
[null,0,{"$f":"C177*kg_mt*VLOOKUP(C$231, stat_factors, 4, FALSE)","v":0},0,0,0,0,0,0,0,0,0,0,0]
[null,"Total",{"$f":"SUM(C232:C251)","v":0},{"$f":"SUM(D232:D251)","v":0},0,0,0,0,0,0,0,0,0,{"$f":"SUM(N232:N236)","v":0}]
[]
["Energy Use by Department and Fuel Type"]
["Energy Consumed (MMbtu) = Units of Fuel Consumed × Heat Content of Fuel (MMBtu/unit)"]
[null,null,{"$f":"TRANSPOSE($B$143:$B$152)","v":"Natural Gas"},"Diesel","Gasoline","LPG","Propane","Butane","Residual Fuel Oil No. 5","Residual Fuel Oil No. 6","Jet Fuel","Bituminous Coal","Digester Gas","TOTAL"]
["Dstart",{"$f":"B232","v":0},{"$f":"C158*VLOOKUP(C$256, stat_factors, 5, FALSE)","v":0},0,0,0,0,0,0,0,0,0,0,{"$f":"SUM(C257:M257)","v":0}]
[null,{"$f":"B233","v":0},{"$f":"C159*VLOOKUP(C$256, stat_factors, 5, FALSE)","v":0},0,0,0,0,0,0,0,0,0,0,{"$f":"SUM(C258:M258)","v":0}]
[null,0,{"$f":"C160*VLOOKUP(C$256, stat_factors, 5, FALSE)","v":0},0,0,0,0,0,0,0,0,0,0,0]
[null,0,{"$f":"C161*VLOOKUP(C$256, stat_factors, 5, FALSE)","v":0},0,0,0,0,0,0,0,0,0,0,0]
[null,0,{"$f":"C162*VLOOKUP(C$256, stat_factors, 5, FALSE)","v":0},0,0,0,0,0,0,0,0,0,0,0]
[null,0,{"$f":"C163*VLOOKUP(C$256, stat_factors, 5, FALSE)","v":0},0,0,0,0,0,0,0,0,0,0,0]
[null,0,{"$f":"C164*VLOOKUP(C$256, stat_factors, 5, FALSE)","v":0},0,0,0,0,0,0,0,0,0,0,0]
[null,0,{"$f":"C165*VLOOKUP(C$256, stat_factors, 5, FALSE)","v":0},0,0,0,0,0,0,0,0,0,0,0]
[null,0,{"$f":"C166*VLOOKUP(C$256, stat_factors, 5, FALSE)","v":0},0,0,0,0,0,0,0,0,0,0,0]
[null,0,{"$f":"C167*VLOOKUP(C$256, stat_factors, 5, FALSE)","v":0},0,0,0,0,0,0,0,0,0,0,0]
[null,0,{"$f":"C168*VLOOKUP(C$256, stat_factors, 5, FALSE)","v":0},0,0,0,0,0,0,0,0,0,0,0]
[null,0,{"$f":"C169*VLOOKUP(C$256, stat_factors, 5, FALSE)","v":0},0,0,0,0,0,0,0,0,0,0,0]
[null,0,{"$f":"C170*VLOOKUP(C$256, stat_factors, 5, FALSE)","v":0},0,0,0,0,0,0,0,0,0,0,0]
[null,0,{"$f":"C171*VLOOKUP(C$256, stat_factors, 5, FALSE)","v":0},0,0,0,0,0,0,0,0,0,0,0]
[null,0,{"$f":"C172*VLOOKUP(C$256, stat_factors, 5, FALSE)","v":0},0,0,0,0,0,0,0,0,0,0,0]
[null,0,{"$f":"C173*VLOOKUP(C$256, stat_factors, 5, FALSE)","v":0},0,0,0,0,0,0,0,0,0,0,0]
[null,0,{"$f":"C174*VLOOKUP(C$256, stat_factors, 5, FALSE)","v":0},0,0,0,0,0,0,0,0,0,0,0]
[null,0,{"$f":"C175*VLOOKUP(C$256, stat_factors, 5, FALSE)","v":0},0,0,0,0,0,0,0,0,0,0,0]
[null,0,{"$f":"C176*VLOOKUP(C$256, stat_factors, 5, FALSE)","v":0},0,0,0,0,0,0,0,0,0,0,0]
[null,0,{"$f":"C177*VLOOKUP(C$256, stat_factors, 5, FALSE)","v":0},0,0,0,0,0,0,0,0,0,0,0]
[null,"Total",{"$f":"SUM(C257:C276)","v":0},{"$f":"SUM(D257:D276)","v":0},0,0,0,0,0,0,0,0,0,{"$f":"SUM(N257:N275)","v":0}]
[]
[]
[]
["Tribal GHG Inventory Tool: Government Operations Module"]

{"sheet":"ElecTemplateReadMe","index":10,"n_rows":23,"n_cols":2,"rows_kept":23,"cut":false,"hidden":true,"merged":[[5,1,5,2],[0,1,0,2],[1,1,1,2],[2,1,2,2],[3,1,3,2],[4,1,4,2],[22,1,22,2],[8,1,8,2],[6,1,6,2],[7,1,7,2],[20,1,20,2],[21,1,21,2]]}
["Electricity Data Template Instructions","This sheet describes the file layout and data parameters needed for batch import."]
[null,"This will allow you to bypass the data entry form and upload multiple lines of data."]
[null,"Please enter your activity data on the following worksheet (DataSheet) according to the parameters below."]
[null,"Copy and paste the data from that sheet onto the \"Electricity-Data\" worksheet in the inventory tool."]
["ID#","This value is automatically supplied when adding data via the input form. You will need to update this manually when using the batch import feature. Please assign a unique value to each line of data you add."]
[null,"Values must be integers in ascending order. Gaps between numbers are permitted. For example, three lines with IDs in order of 11, 12, and 15 are ok; IDs of 11, 15, and 12 is not. The calculations will not be accurate if the ID numbers do not meet this condition."]
[null,"It is recommended that you begin with the highest previous number and increase each additional line by 1."]
["Unit Description","Use this field to describe or name the unit or group that you are entering. This field is for the user's reference only and does not impact the calculations."]
["Facility Type","If you have chosen to enter data at the facility level, please specify the type of facility from the list below. You must use the exact spelling of the facility type provided below."]
[]
[null,"Facility Types"]
[null,"Office Building"]
[null,"Warehouse"]
[null,"Water Infrastructure"]
[null,"Wastewater Infrastructure"]
[null,"Outdoor Lighting"]
[null,"School"]
[null,"Health"]
[null,"Other"]
[]
["Department","Enter one of the departments that were specified on the Control Sheet. You must use the exact spelling of the department that was provided on the Control Sheet in order for each entry to be included in the calculations."]
["Electricity Consumed","Please enter the electricity consumption (in kWh) for the given unit in the inventory year."]
["Electric Utility","Please enter the electric utility that serves each unit."]

{"sheet":"Mobile-Entry","index":11,"n_rows":42,"n_cols":8,"rows_kept":42,"cut":false,"hidden":false,"merged":[[27,3,28,6],[29,4,29,5],[29,3,30,3],[41,0,41,6],[33,1,34,2]]}
["Mobile Combustion - Entry"]
["Data Entry & Calculations"]
[]
[]
[]
[]
[]
[]
[]
[]
[]
[]
[]
[]
[]
["1a)","Describe the vehicle(s) you are entering"]
[null,"ID#","Vehicle or vehicle group description","Department"]
[0,{"$f":"MobCurrentID","v":1}]
[]
[]
[null,"Vehicle Year","Vehicle Type","Vehicle Model (optional)","Fuel type"]
[]
[]
["1b)",{"$f":"\"Enter the activity data for the year \"&MyYear","v":"Enter the activity data for the year "}]
[]
[null,null,"Entries"]
[null,{"$f":"\"Fuel consumed (\"&IF(ISERROR(HLOOKUP(mob_entry_fuel,'Background Controls'!26:27,2,FALSE)),\"\",HLOOKUP(mob_entry_fuel,'Background Controls'!26:27,2,FALSE))&\"):\"","v":"Fuel consumed ():"}]
[null,"Vehicle miles traveled (VMT)*:",null,"* Helpful Hint: If you do not know the VMT for this entry, you can multiply the fuel consumed by the MPG of the vehicle/vehicle group. Use your own efficiency data or see the table below for average MPG by vehicle type and fuel. → Vehicle Miles = Gallons × Miles/Gallon"]
[]
[null,null,null,"Vehicle Type","Average MPG"]
[null,null,null,null,"Gasoline & Other Fuels","Diesel & Biodiesel"]
[null,null,null,"Passenger Car",24.1,32.4]
[null,null,null,"Light Truck",18.5,22.1,null,true]
["2)","Once you have completed data entry, hit the button below to update the calculations.",null,"Heavy-Duty Vehicle",10.130000000000001,12.96]
[null,null,null,"Motorcycle",50,"N/A"]
[]
[]
[]
[]
[]
[]
["Tribal GHG Inventory Tool: Government Operations Module"]

{"sheet":"Mobile-Data","index":12,"n_rows":8,"n_cols":9,"rows_kept":8,"cut":false,"hidden":false,"merged":[]}
["Mobile Combustion - Data"]
[]
[]
[]
["Linker Row- DO NOT MODIFY"]
["ID#","Vehicle or vehicle group description","Department","Vehicle Year","Vehicle Type","Vehicle Model (optional)","Fuel type","Fuel consumption","VMT"]
[{"$f":"MAX(A9:A65536)+1","v":1},{"$f":"mob_entry_description","v":0},{"$f":"mob_entry_dept","v":0},{"$f":"mob_entry_vehyear","v":0},{"$f":"mob_entry_vehtype","v":0},{"$f":"mob_entry_vehmodel","v":0},{"$f":"mob_entry_fuel","v":0},{"$f":"mob_entry_fuelconsumption","v":0},{"$f":"mob_entry_vmt","v":0}]
["Saved Data"]

{"sheet":"MobTemplateReadMe","index":13,"n_rows":66,"n_cols":3,"rows_kept":66,"cut":false,"hidden":true,"merged":[[5,1,5,2],[9,1,9,2],[10,1,10,2],[24,1,24,2],[26,1,26,2],[0,1,0,2],[1,1,1,2],[2,1,2,2],[3,1,3,2],[4,1,4,2],[65,1,65,2],[6,1,6,2],[7,1,7,2],[8,1,8,2],[25,1,25,2],[64,1,64,2]]}
["Mobile Data Template Instructions","This sheet describes the file layout and data parameters needed for batch import."]
[null,"This will allow you to bypass the data entry form and upload multiple lines of data."]
[null,"Please enter your activity data on the following worksheet (DataSheet) according to the parameters below."]
[null,"Copy and paste the data from that sheet onto the Mobile-Data\" worksheet in the inventory tool."]
["ID#","This value is automatically supplied when adding data via the input form. You will need to update this manually when using the batch import feature. Please assign a unique value to each line of data you add."]
[null,"Values must be integers in ascending order. Gaps between numbers are permitted. For example, three lines with IDs in order of 11, 12, and 15 are ok; IDs of 11, 15, and 12 is not. The calculations will not be accurate if the ID numbers do not meet this condition."]
[null,"It is recommended that you begin with the highest previous number and increase each additional line by 1."]
["Vehicle or Vehicle Group Descriptions","Use this field to describe or name the vehicle or group of vehicles that you are entering. This field is for the user's reference only and does not impact the calculations."]
["Department","Enter one of the departments that were specified on the Control Sheet. You must use the exact spelling of the department that was provided on the Control Sheet in order for each entry to be included in the calculations."]
["Vehicle Year","Enter the model year of the vehicle you are entering."]
["Vehicle Type","Please enter the vehicle type from the list below in this column. Be sure to type the name exactly as it appears below."]
[]
[null,"Vehicle Type"]
[null,"Passenger Car"]
[null,"Light Truck (Vans, Pickup Trucks, SUVs)"]
[null,"Heavy-Duty Vehicle"]
[null,"Motorcycle"]
[null,"Agricultural Equipment"]
[null,"Construction Equipment"]
[null,"Utility and Recreational Equipment"]
[null,"Aircraft"]
[null,"Ship or Boat"]
[null,"Locomotive"]
[]
["Vehicle Model","Use this column to enter the vehicle model. This field is optional and for user reference only."]
["Fuel Type","Please enter the fuel type in this column. You must select the fuel type from the list of fuels below, and only select fuels appropriate for the vehicle type. Any other fuels will not be included in the calculations. "]
[null,"The consumptions must also be in the units listed below."]
[]
["Vehicle","Fuel Type","Unit"]
["Passenger Car: ","Gasoline","gallons"]
[null,"Diesel","gallons"]
[null,"Biodiesel (B5)","gallons"]
[null,"Biodiesel (B20)","gallons"]
[null,"Ethanol (E5)","gallons"]
[null,"CNG","G.G.E."]
[null,"LPG","gallons"]
["Light Truck (Vans, Pickup Trucks, SUVs): ","Gasoline","gallons"]
[null,"Diesel","gallons"]
[null,"Biodiesel (B5)","gallons"]
[null,"Biodiesel (B20)","gallons"]
[null,"Ethanol (E5)","gallons"]
[null,"CNG","G.G.E."]
[null,"LPG","gallons"]
["Heavy-Duty Vehicle: ","Gasoline","gallons"]
[null,"Diesel","gallons"]
[null,"Biodiesel (B5)","gallons"]
[null,"Biodiesel (B20)","gallons"]
[null,"Ethanol (E5)","gallons"]
[null,"CNG","G.G.E."]
[null,"LNG","gallons"]
[null,"LPG","gallons"]
["Motorcycle: ","Gasoline","gallons"]
["Agricultural Equipment: ","Gasoline","gallons"]
[null,"Diesel","gallons"]
["Construction Equipment: ","Gasoline","gallons"]
[null,"Diesel","gallons"]
["Utility and Recreational Equipment: ","Gasoline","gallons"]
[null,"Diesel","gallons"]
["Aircraft: ","Jet Fuel","gallons"]
[null,"Aviation Gasoline","gallons"]
["Ship or Boat: ","Gasoline","gallons"]
[null,"Diesel","gallons"]
[null,"Residual Fuel","gallons"]
["Locomotive: ","Diesel","gallons"]
["Fuel Consumed","Please enter your fuel consumption for the inventory year here."]
["Vehicle Miles Traveled (VMT)","Please enter the miles traveled by the vehicle during the inventory year here. "]

{"sheet":"Mobile-Summary","index":14,"n_rows":81,"n_cols":19,"rows_kept":81,"cut":false,"hidden":false,"merged":[[4,1,4,5],[4,8,4,10],[31,1,31,13],[80,0,80,15]]}
["Mobile Combustion - Summary"]
[]
["GHG Summary"]
[]
[null,"Net Emissions by Department (CO2e)",null,null,null,null,null,null,"CO2 Detail Emissions"]
[null,null,"CO2","CH4","N2O","TOTAL",null,null,"Gross CO2","- Biogenic =","Net CO2"]
["Dstart",{"$f":"B34","v":0},{"$f":"'Mobile-Detail Calcs'!N129","v":0},{"$f":"'Mobile-Detail Calcs'!C251","v":0},{"$f":"'Mobile-Detail Calcs'!D251","v":0},{"$f":"SUM(C7:E7)","v":0},null,null,{"$f":"'Mobile-Detail Calcs'!N77","v":0},{"$f":"'Mobile-Detail Calcs'!N103","v":0},{"$f":"'Mobile-Detail Calcs'!N129","v":0}]
[null,0,{"$f":"'Mobile-Detail Calcs'!N130","v":0},{"$f":"'Mobile-Detail Calcs'!C252","v":0},{"$f":"'Mobile-Detail Calcs'!D252","v":0},{"$f":"SUM(C8:E8)","v":0},null,null,{"$f":"'Mobile-Detail Calcs'!N78","v":0},{"$f":"'Mobile-Detail Calcs'!N104","v":0},{"$f":"'Mobile-Detail Calcs'!N130","v":0}]
[null,0,{"$f":"'Mobile-Detail Calcs'!N131","v":0},{"$f":"'Mobile-Detail Calcs'!C253","v":0},{"$f":"'Mobile-Detail Calcs'!D253","v":0},0,null,null,{"$f":"'Mobile-Detail Calcs'!N79","v":0},{"$f":"'Mobile-Detail Calcs'!N105","v":0},{"$f":"'Mobile-Detail Calcs'!N131","v":0}]
[null,0,{"$f":"'Mobile-Detail Calcs'!N132","v":0},{"$f":"'Mobile-Detail Calcs'!C254","v":0},{"$f":"'Mobile-Detail Calcs'!D254","v":0},0,null,null,{"$f":"'Mobile-Detail Calcs'!N80","v":0},{"$f":"'Mobile-Detail Calcs'!N106","v":0},{"$f":"'Mobile-Detail Calcs'!N132","v":0}]
[null,0,{"$f":"'Mobile-Detail Calcs'!N133","v":0},{"$f":"'Mobile-Detail Calcs'!C255","v":0},{"$f":"'Mobile-Detail Calcs'!D255","v":0},0,null,null,{"$f":"'Mobile-Detail Calcs'!N81","v":0},{"$f":"'Mobile-Detail Calcs'!N107","v":0},{"$f":"'Mobile-Detail Calcs'!N133","v":0}]
[null,0,{"$f":"'Mobile-Detail Calcs'!N134","v":0},{"$f":"'Mobile-Detail Calcs'!C256","v":0},{"$f":"'Mobile-Detail Calcs'!D256","v":0},0,null,null,{"$f":"'Mobile-Detail Calcs'!N82","v":0},{"$f":"'Mobile-Detail Calcs'!N108","v":0},{"$f":"'Mobile-Detail Calcs'!N134","v":0}]
[null,0,{"$f":"'Mobile-Detail Calcs'!N135","v":0},{"$f":"'Mobile-Detail Calcs'!C257","v":0},{"$f":"'Mobile-Detail Calcs'!D257","v":0},0,null,null,{"$f":"'Mobile-Detail Calcs'!N83","v":0},{"$f":"'Mobile-Detail Calcs'!N109","v":0},{"$f":"'Mobile-Detail Calcs'!N135","v":0}]
[null,0,{"$f":"'Mobile-Detail Calcs'!N136","v":0},{"$f":"'Mobile-Detail Calcs'!C258","v":0},{"$f":"'Mobile-Detail Calcs'!D258","v":0},0,null,null,{"$f":"'Mobile-Detail Calcs'!N84","v":0},{"$f":"'Mobile-Detail Calcs'!N110","v":0},{"$f":"'Mobile-Detail Calcs'!N136","v":0}]
[null,0,{"$f":"'Mobile-Detail Calcs'!N137","v":0},{"$f":"'Mobile-Detail Calcs'!C259","v":0},{"$f":"'Mobile-Detail Calcs'!D259","v":0},0,null,null,{"$f":"'Mobile-Detail Calcs'!N85","v":0},{"$f":"'Mobile-Detail Calcs'!N111","v":0},{"$f":"'Mobile-Detail Calcs'!N137","v":0}]
[null,0,{"$f":"'Mobile-Detail Calcs'!N138","v":0},{"$f":"'Mobile-Detail Calcs'!C260","v":0},{"$f":"'Mobile-Detail Calcs'!D260","v":0},0,null,null,{"$f":"'Mobile-Detail Calcs'!N86","v":0},{"$f":"'Mobile-Detail Calcs'!N112","v":0},{"$f":"'Mobile-Detail Calcs'!N138","v":0}]
[null,0,{"$f":"'Mobile-Detail Calcs'!N139","v":0},{"$f":"'Mobile-Detail Calcs'!C261","v":0},{"$f":"'Mobile-Detail Calcs'!D261","v":0},0,null,null,{"$f":"'Mobile-Detail Calcs'!N87","v":0},{"$f":"'Mobile-Detail Calcs'!N113","v":0},{"$f":"'Mobile-Detail Calcs'!N139","v":0}]
[null,0,{"$f":"'Mobile-Detail Calcs'!N140","v":0},{"$f":"'Mobile-Detail Calcs'!C262","v":0},{"$f":"'Mobile-Detail Calcs'!D262","v":0},0,null,null,{"$f":"'Mobile-Detail Calcs'!N88","v":0},{"$f":"'Mobile-Detail Calcs'!N114","v":0},{"$f":"'Mobile-Detail Calcs'!N140","v":0}]
[null,0,{"$f":"'Mobile-Detail Calcs'!N141","v":0},{"$f":"'Mobile-Detail Calcs'!C263","v":0},{"$f":"'Mobile-Detail Calcs'!D263","v":0},0,null,null,{"$f":"'Mobile-Detail Calcs'!N89","v":0},{"$f":"'Mobile-Detail Calcs'!N115","v":0},{"$f":"'Mobile-Detail Calcs'!N141","v":0}]
[null,0,{"$f":"'Mobile-Detail Calcs'!N142","v":0},{"$f":"'Mobile-Detail Calcs'!C264","v":0},{"$f":"'Mobile-Detail Calcs'!D264","v":0},0,null,null,{"$f":"'Mobile-Detail Calcs'!N90","v":0},{"$f":"'Mobile-Detail Calcs'!N116","v":0},{"$f":"'Mobile-Detail Calcs'!N142","v":0}]
[null,0,{"$f":"'Mobile-Detail Calcs'!N143","v":0},{"$f":"'Mobile-Detail Calcs'!C265","v":0},{"$f":"'Mobile-Detail Calcs'!D265","v":0},0,null,null,{"$f":"'Mobile-Detail Calcs'!N91","v":0},{"$f":"'Mobile-Detail Calcs'!N117","v":0},{"$f":"'Mobile-Detail Calcs'!N143","v":0}]
[null,0,{"$f":"'Mobile-Detail Calcs'!N144","v":0},{"$f":"'Mobile-Detail Calcs'!C266","v":0},{"$f":"'Mobile-Detail Calcs'!D266","v":0},0,null,null,{"$f":"'Mobile-Detail Calcs'!N92","v":0},{"$f":"'Mobile-Detail Calcs'!N118","v":0},{"$f":"'Mobile-Detail Calcs'!N144","v":0}]
[null,0,{"$f":"'Mobile-Detail Calcs'!N145","v":0},{"$f":"'Mobile-Detail Calcs'!C267","v":0},{"$f":"'Mobile-Detail Calcs'!D267","v":0},0,null,null,{"$f":"'Mobile-Detail Calcs'!N93","v":0},{"$f":"'Mobile-Detail Calcs'!N119","v":0},{"$f":"'Mobile-Detail Calcs'!N145","v":0}]
[null,0,{"$f":"'Mobile-Detail Calcs'!N146","v":0},{"$f":"'Mobile-Detail Calcs'!C268","v":0},{"$f":"'Mobile-Detail Calcs'!D268","v":0},0,null,null,{"$f":"'Mobile-Detail Calcs'!N94","v":0},{"$f":"'Mobile-Detail Calcs'!N120","v":0},{"$f":"'Mobile-Detail Calcs'!N146","v":0}]
[null,0,{"$f":"'Mobile-Detail Calcs'!N147","v":0},{"$f":"'Mobile-Detail Calcs'!C269","v":0},{"$f":"'Mobile-Detail Calcs'!D269","v":0},0,null,null,{"$f":"'Mobile-Detail Calcs'!N95","v":0},{"$f":"'Mobile-Detail Calcs'!N121","v":0},{"$f":"'Mobile-Detail Calcs'!N147","v":0}]
[null,0,{"$f":"'Mobile-Detail Calcs'!N148","v":0},{"$f":"'Mobile-Detail Calcs'!C270","v":0},{"$f":"'Mobile-Detail Calcs'!D270","v":0},0,null,null,{"$f":"'Mobile-Detail Calcs'!N96","v":0},{"$f":"'Mobile-Detail Calcs'!N122","v":0},{"$f":"'Mobile-Detail Calcs'!N148","v":0}]
[null,"Total Mobile Emissions",{"$f":"SUM(C7:C26)","v":0},{"$f":"SUM(D7:D26)","v":0},0,{"$f":"SUM(C27:E27)","v":0},null,null,{"$f":"SUM(I7:I26)","v":0},{"$f":"SUM(J7:J26)","v":0},{"$f":"SUM(K7:K26)","v":0}]
[]
[]
["Energy Use Summary"]
[]
[null,"Energy Use by Department and Fuel Type (MMBtu)"]
[null,null,"Gasoline","Diesel","Biodiesel (B5)","Biodiesel (B20)","Ethanol (E85)","CNG","LNG","LPG","Residual Fuel","Jet Fuel","Aviation Gasoline","TOTAL"]
["Dstart",{"$f":"'Background Controls'!I5","v":0},{"$f":"'Mobile-Detail Calcs'!C48","v":0},{"$f":"'Mobile-Detail Calcs'!D48","v":0},{"$f":"'Mobile-Detail Calcs'!E48","v":0},{"$f":"'Mobile-Detail Calcs'!F48","v":0},{"$f":"'Mobile-Detail Calcs'!G48","v":0},{"$f":"'Mobile-Detail Calcs'!H48","v":0},{"$f":"'Mobile-Detail Calcs'!I48","v":0},{"$f":"'Mobile-Detail Calcs'!J48","v":0},{"$f":"'Mobile-Detail Calcs'!K48","v":0},{"$f":"'Mobile-Detail Calcs'!L48","v":0},{"$f":"'Mobile-Detail Calcs'!M48","v":0},{"$f":"SUM(C34:M34)","v":0}]
[null,{"$f":"'Background Controls'!I6","v":0},{"$f":"'Mobile-Detail Calcs'!C49","v":0},{"$f":"'Mobile-Detail Calcs'!D49","v":0},{"$f":"'Mobile-Detail Calcs'!E49","v":0},{"$f":"'Mobile-Detail Calcs'!F49","v":0},{"$f":"'Mobile-Detail Calcs'!G49","v":0},{"$f":"'Mobile-Detail Calcs'!H49","v":0},{"$f":"'Mobile-Detail Calcs'!I49","v":0},{"$f":"'Mobile-Detail Calcs'!J49","v":0},{"$f":"'Mobile-Detail Calcs'!K49","v":0},{"$f":"'Mobile-Detail Calcs'!L49","v":0},{"$f":"'Mobile-Detail Calcs'!M49","v":0},{"$f":"SUM(C35:M35)","v":0}]
[null,{"$f":"'Background Controls'!I7","v":0},{"$f":"'Mobile-Detail Calcs'!C50","v":0},{"$f":"'Mobile-Detail Calcs'!D50","v":0},{"$f":"'Mobile-Detail Calcs'!E50","v":0},{"$f":"'Mobile-Detail Calcs'!F50","v":0},{"$f":"'Mobile-Detail Calcs'!G50","v":0},{"$f":"'Mobile-Detail Calcs'!H50","v":0},{"$f":"'Mobile-Detail Calcs'!I50","v":0},{"$f":"'Mobile-Detail Calcs'!J50","v":0},{"$f":"'Mobile-Detail Calcs'!K50","v":0},{"$f":"'Mobile-Detail Calcs'!L50","v":0},{"$f":"'Mobile-Detail Calcs'!M50","v":0},0]
[null,{"$f":"'Background Controls'!I8","v":0},{"$f":"'Mobile-Detail Calcs'!C51","v":0},{"$f":"'Mobile-Detail Calcs'!D51","v":0},{"$f":"'Mobile-Detail Calcs'!E51","v":0},{"$f":"'Mobile-Detail Calcs'!F51","v":0},{"$f":"'Mobile-Detail Calcs'!G51","v":0},{"$f":"'Mobile-Detail Calcs'!H51","v":0},{"$f":"'Mobile-Detail Calcs'!I51","v":0},{"$f":"'Mobile-Detail Calcs'!J51","v":0},{"$f":"'Mobile-Detail Calcs'!K51","v":0},{"$f":"'Mobile-Detail Calcs'!L51","v":0},{"$f":"'Mobile-Detail Calcs'!M51","v":0},0]
[null,{"$f":"'Background Controls'!I9","v":0},{"$f":"'Mobile-Detail Calcs'!C52","v":0},{"$f":"'Mobile-Detail Calcs'!D52","v":0},{"$f":"'Mobile-Detail Calcs'!E52","v":0},{"$f":"'Mobile-Detail Calcs'!F52","v":0},{"$f":"'Mobile-Detail Calcs'!G52","v":0},{"$f":"'Mobile-Detail Calcs'!H52","v":0},{"$f":"'Mobile-Detail Calcs'!I52","v":0},{"$f":"'Mobile-Detail Calcs'!J52","v":0},{"$f":"'Mobile-Detail Calcs'!K52","v":0},{"$f":"'Mobile-Detail Calcs'!L52","v":0},{"$f":"'Mobile-Detail Calcs'!M52","v":0},0]
[null,{"$f":"'Background Controls'!I10","v":0},{"$f":"'Mobile-Detail Calcs'!C53","v":0},{"$f":"'Mobile-Detail Calcs'!D53","v":0},{"$f":"'Mobile-Detail Calcs'!E53","v":0},{"$f":"'Mobile-Detail Calcs'!F53","v":0},{"$f":"'Mobile-Detail Calcs'!G53","v":0},{"$f":"'Mobile-Detail Calcs'!H53","v":0},{"$f":"'Mobile-Detail Calcs'!I53","v":0},{"$f":"'Mobile-Detail Calcs'!J53","v":0},{"$f":"'Mobile-Detail Calcs'!K53","v":0},{"$f":"'Mobile-Detail Calcs'!L53","v":0},{"$f":"'Mobile-Detail Calcs'!M53","v":0},0]
[null,{"$f":"'Background Controls'!I11","v":0},{"$f":"'Mobile-Detail Calcs'!C54","v":0},{"$f":"'Mobile-Detail Calcs'!D54","v":0},{"$f":"'Mobile-Detail Calcs'!E54","v":0},{"$f":"'Mobile-Detail Calcs'!F54","v":0},{"$f":"'Mobile-Detail Calcs'!G54","v":0},{"$f":"'Mobile-Detail Calcs'!H54","v":0},{"$f":"'Mobile-Detail Calcs'!I54","v":0},{"$f":"'Mobile-Detail Calcs'!J54","v":0},{"$f":"'Mobile-Detail Calcs'!K54","v":0},{"$f":"'Mobile-Detail Calcs'!L54","v":0},{"$f":"'Mobile-Detail Calcs'!M54","v":0},0]
[null,{"$f":"'Background Controls'!I12","v":0},{"$f":"'Mobile-Detail Calcs'!C55","v":0},{"$f":"'Mobile-Detail Calcs'!D55","v":0},{"$f":"'Mobile-Detail Calcs'!E55","v":0},{"$f":"'Mobile-Detail Calcs'!F55","v":0},{"$f":"'Mobile-Detail Calcs'!G55","v":0},{"$f":"'Mobile-Detail Calcs'!H55","v":0},{"$f":"'Mobile-Detail Calcs'!I55","v":0},{"$f":"'Mobile-Detail Calcs'!J55","v":0},{"$f":"'Mobile-Detail Calcs'!K55","v":0},{"$f":"'Mobile-Detail Calcs'!L55","v":0},{"$f":"'Mobile-Detail Calcs'!M55","v":0},0]
[null,{"$f":"'Background Controls'!I13","v":0},{"$f":"'Mobile-Detail Calcs'!C56","v":0},{"$f":"'Mobile-Detail Calcs'!D56","v":0},{"$f":"'Mobile-Detail Calcs'!E56","v":0},{"$f":"'Mobile-Detail Calcs'!F56","v":0},{"$f":"'Mobile-Detail Calcs'!G56","v":0},{"$f":"'Mobile-Detail Calcs'!H56","v":0},{"$f":"'Mobile-Detail Calcs'!I56","v":0},{"$f":"'Mobile-Detail Calcs'!J56","v":0},{"$f":"'Mobile-Detail Calcs'!K56","v":0},{"$f":"'Mobile-Detail Calcs'!L56","v":0},{"$f":"'Mobile-Detail Calcs'!M56","v":0},0]
[null,{"$f":"'Background Controls'!I14","v":0},{"$f":"'Mobile-Detail Calcs'!C57","v":0},{"$f":"'Mobile-Detail Calcs'!D57","v":0},{"$f":"'Mobile-Detail Calcs'!E57","v":0},{"$f":"'Mobile-Detail Calcs'!F57","v":0},{"$f":"'Mobile-Detail Calcs'!G57","v":0},{"$f":"'Mobile-Detail Calcs'!H57","v":0},{"$f":"'Mobile-Detail Calcs'!I57","v":0},{"$f":"'Mobile-Detail Calcs'!J57","v":0},{"$f":"'Mobile-Detail Calcs'!K57","v":0},{"$f":"'Mobile-Detail Calcs'!L57","v":0},{"$f":"'Mobile-Detail Calcs'!M57","v":0},0]
[null,{"$f":"'Background Controls'!I15","v":0},{"$f":"'Mobile-Detail Calcs'!C58","v":0},{"$f":"'Mobile-Detail Calcs'!D58","v":0},{"$f":"'Mobile-Detail Calcs'!E58","v":0},{"$f":"'Mobile-Detail Calcs'!F58","v":0},{"$f":"'Mobile-Detail Calcs'!G58","v":0},{"$f":"'Mobile-Detail Calcs'!H58","v":0},{"$f":"'Mobile-Detail Calcs'!I58","v":0},{"$f":"'Mobile-Detail Calcs'!J58","v":0},{"$f":"'Mobile-Detail Calcs'!K58","v":0},{"$f":"'Mobile-Detail Calcs'!L58","v":0},{"$f":"'Mobile-Detail Calcs'!M58","v":0},0]
[null,{"$f":"'Background Controls'!I16","v":0},{"$f":"'Mobile-Detail Calcs'!C59","v":0},{"$f":"'Mobile-Detail Calcs'!D59","v":0},{"$f":"'Mobile-Detail Calcs'!E59","v":0},{"$f":"'Mobile-Detail Calcs'!F59","v":0},{"$f":"'Mobile-Detail Calcs'!G59","v":0},{"$f":"'Mobile-Detail Calcs'!H59","v":0},{"$f":"'Mobile-Detail Calcs'!I59","v":0},{"$f":"'Mobile-Detail Calcs'!J59","v":0},{"$f":"'Mobile-Detail Calcs'!K59","v":0},{"$f":"'Mobile-Detail Calcs'!L59","v":0},{"$f":"'Mobile-Detail Calcs'!M59","v":0},0]
[null,{"$f":"'Background Controls'!I17","v":0},{"$f":"'Mobile-Detail Calcs'!C60","v":0},{"$f":"'Mobile-Detail Calcs'!D60","v":0},{"$f":"'Mobile-Detail Calcs'!E60","v":0},{"$f":"'Mobile-Detail Calcs'!F60","v":0},{"$f":"'Mobile-Detail Calcs'!G60","v":0},{"$f":"'Mobile-Detail Calcs'!H60","v":0},{"$f":"'Mobile-Detail Calcs'!I60","v":0},{"$f":"'Mobile-Detail Calcs'!J60","v":0},{"$f":"'Mobile-Detail Calcs'!K60","v":0},{"$f":"'Mobile-Detail Calcs'!L60","v":0},{"$f":"'Mobile-Detail Calcs'!M60","v":0},0]
[null,{"$f":"'Background Controls'!I18","v":0},{"$f":"'Mobile-Detail Calcs'!C61","v":0},{"$f":"'Mobile-Detail Calcs'!D61","v":0},{"$f":"'Mobile-Detail Calcs'!E61","v":0},{"$f":"'Mobile-Detail Calcs'!F61","v":0},{"$f":"'Mobile-Detail Calcs'!G61","v":0},{"$f":"'Mobile-Detail Calcs'!H61","v":0},{"$f":"'Mobile-Detail Calcs'!I61","v":0},{"$f":"'Mobile-Detail Calcs'!J61","v":0},{"$f":"'Mobile-Detail Calcs'!K61","v":0},{"$f":"'Mobile-Detail Calcs'!L61","v":0},{"$f":"'Mobile-Detail Calcs'!M61","v":0},0]
[null,{"$f":"'Background Controls'!I19","v":0},{"$f":"'Mobile-Detail Calcs'!C62","v":0},{"$f":"'Mobile-Detail Calcs'!D62","v":0},{"$f":"'Mobile-Detail Calcs'!E62","v":0},{"$f":"'Mobile-Detail Calcs'!F62","v":0},{"$f":"'Mobile-Detail Calcs'!G62","v":0},{"$f":"'Mobile-Detail Calcs'!H62","v":0},{"$f":"'Mobile-Detail Calcs'!I62","v":0},{"$f":"'Mobile-Detail Calcs'!J62","v":0},{"$f":"'Mobile-Detail Calcs'!K62","v":0},{"$f":"'Mobile-Detail Calcs'!L62","v":0},{"$f":"'Mobile-Detail Calcs'!M62","v":0},0]
[null,{"$f":"'Background Controls'!I20","v":0},{"$f":"'Mobile-Detail Calcs'!C63","v":0},{"$f":"'Mobile-Detail Calcs'!D63","v":0},{"$f":"'Mobile-Detail Calcs'!E63","v":0},{"$f":"'Mobile-Detail Calcs'!F63","v":0},{"$f":"'Mobile-Detail Calcs'!G63","v":0},{"$f":"'Mobile-Detail Calcs'!H63","v":0},{"$f":"'Mobile-Detail Calcs'!I63","v":0},{"$f":"'Mobile-Detail Calcs'!J63","v":0},{"$f":"'Mobile-Detail Calcs'!K63","v":0},{"$f":"'Mobile-Detail Calcs'!L63","v":0},{"$f":"'Mobile-Detail Calcs'!M63","v":0},0]
[null,{"$f":"'Background Controls'!I21","v":0},{"$f":"'Mobile-Detail Calcs'!C64","v":0},{"$f":"'Mobile-Detail Calcs'!D64","v":0},{"$f":"'Mobile-Detail Calcs'!E64","v":0},{"$f":"'Mobile-Detail Calcs'!F64","v":0},{"$f":"'Mobile-Detail Calcs'!G64","v":0},{"$f":"'Mobile-Detail Calcs'!H64","v":0},{"$f":"'Mobile-Detail Calcs'!I64","v":0},{"$f":"'Mobile-Detail Calcs'!J64","v":0},{"$f":"'Mobile-Detail Calcs'!K64","v":0},{"$f":"'Mobile-Detail Calcs'!L64","v":0},{"$f":"'Mobile-Detail Calcs'!M64","v":0},0]
[null,{"$f":"'Background Controls'!I22","v":0},{"$f":"'Mobile-Detail Calcs'!C65","v":0},{"$f":"'Mobile-Detail Calcs'!D65","v":0},{"$f":"'Mobile-Detail Calcs'!E65","v":0},{"$f":"'Mobile-Detail Calcs'!F65","v":0},{"$f":"'Mobile-Detail Calcs'!G65","v":0},{"$f":"'Mobile-Detail Calcs'!H65","v":0},{"$f":"'Mobile-Detail Calcs'!I65","v":0},{"$f":"'Mobile-Detail Calcs'!J65","v":0},{"$f":"'Mobile-Detail Calcs'!K65","v":0},{"$f":"'Mobile-Detail Calcs'!L65","v":0},{"$f":"'Mobile-Detail Calcs'!M65","v":0},0]
[null,{"$f":"'Background Controls'!I23","v":0},{"$f":"'Mobile-Detail Calcs'!C66","v":0},{"$f":"'Mobile-Detail Calcs'!D66","v":0},{"$f":"'Mobile-Detail Calcs'!E66","v":0},{"$f":"'Mobile-Detail Calcs'!F66","v":0},{"$f":"'Mobile-Detail Calcs'!G66","v":0},{"$f":"'Mobile-Detail Calcs'!H66","v":0},{"$f":"'Mobile-Detail Calcs'!I66","v":0},{"$f":"'Mobile-Detail Calcs'!J66","v":0},{"$f":"'Mobile-Detail Calcs'!K66","v":0},{"$f":"'Mobile-Detail Calcs'!L66","v":0},{"$f":"'Mobile-Detail Calcs'!M66","v":0},0]
[null,{"$f":"'Background Controls'!I24","v":0},{"$f":"'Mobile-Detail Calcs'!C67","v":0},{"$f":"'Mobile-Detail Calcs'!D67","v":0},{"$f":"'Mobile-Detail Calcs'!E67","v":0},{"$f":"'Mobile-Detail Calcs'!F67","v":0},{"$f":"'Mobile-Detail Calcs'!G67","v":0},{"$f":"'Mobile-Detail Calcs'!H67","v":0},{"$f":"'Mobile-Detail Calcs'!I67","v":0},{"$f":"'Mobile-Detail Calcs'!J67","v":0},{"$f":"'Mobile-Detail Calcs'!K67","v":0},{"$f":"'Mobile-Detail Calcs'!L67","v":0},{"$f":"'Mobile-Detail Calcs'!M67","v":0},0]
[null,"Total",{"$f":"SUM(C34:C53)","v":0},{"$f":"SUM(D34:D53)","v":0},0,0,0,0,0,0,0,0,0,{"$f":"SUM(N34:N53)","v":0}]
[]
[]
[null,"Check to display: "]
[null,null,null,null,null,null,null,null,null,null,null,null,null,null,null,null,null,"emissions",true]
[null,null,null,null,null,null,null,null,null,null,null,null,null,null,null,null,null,"energy",true]
[null,null,null,null,null,null,null,null,null,null,null,null,null,null,null,null,null,"both",{"$f":"AND(S58:S59)","v":true}]
[null,null,null,null,null,null,null,null,null,null,null,null,null,null,null,null,null,null,{"$f":"IF(S60=TRUE, R60, IF(S58=TRUE, R58, IF(S59=TRUE, R59,\"both\")))","v":"both"}]
[]
[]
[]
[]
[]
[]
[]
[]
[]
[]
[]
[]
[]
[]
[]
[]
[]
[]
[]
["Tribal GHG Inventory Tool: Government Operations Module"]

{"sheet":"Mobile-Detail Calcs","index":15,"n_rows":275,"n_cols":27,"rows_kept":275,"cut":false,"hidden":false,"merged":[[161,2,161,4],[274,0,274,15]]}
["Mobile Combustion - Calculation"]
["Jump to…"]
["Activity Data"]
["Fuel use by department and fuel type"]
["Energy use by department and fuel type"]
["CO2 Calculations"]
["Gross CO2"]
["Biogenic CO2"]
["Net CO2"]
["Non-CO2 Calculations"]
["Highway Vehicles"]
["Alternate Fuel Vehicles (AFVs)"]
["Non-Highway Vehicles"]
["Total non-CO2 emissions, current department"]
["Non-CO2 emissions summary, all departments"]
[]
["Activity Data"]
[]
["Fuel Use by Department and Fuel Type"]
["This table summarizes fuel consumption by department. These are the activity data used to calculate CO2 emissions."]
[null,null,"Gasoline","Diesel","Biodiesel (B5)","Biodiesel (B20)","Ethanol (E85)","CNG","LNG","LPG","Residual Fuel","Jet Fuel","Aviation Gasoline"]
[null,"Units","Gallons","Gallons","Gallons","Gallons","Gallons","G.G.E.","Gallons","Gallons","Gallons","Gallons","Gallons"]
["Dstart",{"$f":"'Background Controls'!I5","v":0},{"$f":"SUMIFS('Mobile-Data'!$H$9:$H$1048576,'Mobile-Data'!$C$9:$C$1048576,'Mobile-Detail Calcs'!$B23,'Mobile-Data'!$G$9:$G$1048576,'Mobile-Detail Calcs'!C$21)","v":0},{"$f":"SUMIFS('Mobile-Data'!$H$9:$H$1048576,'Mobile-Data'!$C$9:$C$1048576,'Mobile-Detail Calcs'!$B23,'Mobile-Data'!$G$9:$G$1048576,'Mobile-Detail Calcs'!D$21)","v":0},{"$f":"SUMIFS('Mobile-Data'!$H$9:$H$1048576,'Mobile-Data'!$C$9:$C$1048576,'Mobile-Detail Calcs'!$B23,'Mobile-Data'!$G$9:$G$1048576,'Mobile-Detail Calcs'!E$21)","v":0},{"$f":"SUMIFS('Mobile-Data'!$H$9:$H$1048576,'Mobile-Data'!$C$9:$C$1048576,'Mobile-Detail Calcs'!$B23,'Mobile-Data'!$G$9:$G$1048576,'Mobile-Detail Calcs'!F$21)","v":0},{"$f":"SUMIFS('Mobile-Data'!$H$9:$H$1048576,'Mobile-Data'!$C$9:$C$1048576,'Mobile-Detail Calcs'!$B23,'Mobile-Data'!$G$9:$G$1048576,'Mobile-Detail Calcs'!G$21)","v":0},{"$f":"SUMIFS('Mobile-Data'!$H$9:$H$1048576,'Mobile-Data'!$C$9:$C$1048576,'Mobile-Detail Calcs'!$B23,'Mobile-Data'!$G$9:$G$1048576,'Mobile-Detail Calcs'!H$21)","v":0},{"$f":"SUMIFS('Mobile-Data'!$H$9:$H$1048576,'Mobile-Data'!$C$9:$C$1048576,'Mobile-Detail Calcs'!$B23,'Mobile-Data'!$G$9:$G$1048576,'Mobile-Detail Calcs'!I$21)","v":0},{"$f":"SUMIFS('Mobile-Data'!$H$9:$H$1048576,'Mobile-Data'!$C$9:$C$1048576,'Mobile-Detail Calcs'!$B23,'Mobile-Data'!$G$9:$G$1048576,'Mobile-Detail Calcs'!J$21)","v":0},{"$f":"SUMIFS('Mobile-Data'!$H$9:$H$1048576,'Mobile-Data'!$C$9:$C$1048576,'Mobile-Detail Calcs'!$B23,'Mobile-Data'!$G$9:$G$1048576,'Mobile-Detail Calcs'!K$21)","v":0},{"$f":"SUMIFS('Mobile-Data'!$H$9:$H$1048576,'Mobile-Data'!$C$9:$C$1048576,'Mobile-Detail Calcs'!$B23,'Mobile-Data'!$G$9:$G$1048576,'Mobile-Detail Calcs'!L$21)","v":0},{"$f":"SUMIFS('Mobile-Data'!$H$9:$H$1048576,'Mobile-Data'!$C$9:$C$1048576,'Mobile-Detail Calcs'!$B23,'Mobile-Data'!$G$9:$G$1048576,'Mobile-Detail Calcs'!M$21)","v":0}]
[null,{"$f":"'Background Controls'!I6","v":0},{"$f":"SUMIFS('Mobile-Data'!$H$9:$H$1048576,'Mobile-Data'!$C$9:$C$1048576,'Mobile-Detail Calcs'!$B24,'Mobile-Data'!$G$9:$G$1048576,'Mobile-Detail Calcs'!C$21)","v":0},{"$f":"SUMIFS('Mobile-Data'!$H$9:$H$1048576,'Mobile-Data'!$C$9:$C$1048576,'Mobile-Detail Calcs'!$B24,'Mobile-Data'!$G$9:$G$1048576,'Mobile-Detail Calcs'!D$21)","v":0},{"$f":"SUMIFS('Mobile-Data'!$H$9:$H$1048576,'Mobile-Data'!$C$9:$C$1048576,'Mobile-Detail Calcs'!$B24,'Mobile-Data'!$G$9:$G$1048576,'Mobile-Detail Calcs'!E$21)","v":0},{"$f":"SUMIFS('Mobile-Data'!$H$9:$H$1048576,'Mobile-Data'!$C$9:$C$1048576,'Mobile-Detail Calcs'!$B24,'Mobile-Data'!$G$9:$G$1048576,'Mobile-Detail Calcs'!F$21)","v":0},{"$f":"SUMIFS('Mobile-Data'!$H$9:$H$1048576,'Mobile-Data'!$C$9:$C$1048576,'Mobile-Detail Calcs'!$B24,'Mobile-Data'!$G$9:$G$1048576,'Mobile-Detail Calcs'!G$21)","v":0},{"$f":"SUMIFS('Mobile-Data'!$H$9:$H$1048576,'Mobile-Data'!$C$9:$C$1048576,'Mobile-Detail Calcs'!$B24,'Mobile-Data'!$G$9:$G$1048576,'Mobile-Detail Calcs'!H$21)","v":0},{"$f":"SUMIFS('Mobile-Data'!$H$9:$H$1048576,'Mobile-Data'!$C$9:$C$1048576,'Mobile-Detail Calcs'!$B24,'Mobile-Data'!$G$9:$G$1048576,'Mobile-Detail Calcs'!I$21)","v":0},{"$f":"SUMIFS('Mobile-Data'!$H$9:$H$1048576,'Mobile-Data'!$C$9:$C$1048576,'Mobile-Detail Calcs'!$B24,'Mobile-Data'!$G$9:$G$1048576,'Mobile-Detail Calcs'!J$21)","v":0},{"$f":"SUMIFS('Mobile-Data'!$H$9:$H$1048576,'Mobile-Data'!$C$9:$C$1048576,'Mobile-Detail Calcs'!$B24,'Mobile-Data'!$G$9:$G$1048576,'Mobile-Detail Calcs'!K$21)","v":0},{"$f":"SUMIFS('Mobile-Data'!$H$9:$H$1048576,'Mobile-Data'!$C$9:$C$1048576,'Mobile-Detail Calcs'!$B24,'Mobile-Data'!$G$9:$G$1048576,'Mobile-Detail Calcs'!L$21)","v":0},{"$f":"SUMIFS('Mobile-Data'!$H$9:$H$1048576,'Mobile-Data'!$C$9:$C$1048576,'Mobile-Detail Calcs'!$B24,'Mobile-Data'!$G$9:$G$1048576,'Mobile-Detail Calcs'!M$21)","v":0}]
[null,{"$f":"'Background Controls'!I7","v":0},{"$f":"SUMIFS('Mobile-Data'!$H$9:$H$1048576,'Mobile-Data'!$C$9:$C$1048576,'Mobile-Detail Calcs'!$B25,'Mobile-Data'!$G$9:$G$1048576,'Mobile-Detail Calcs'!C$21)","v":0},{"$f":"SUMIFS('Mobile-Data'!$H$9:$H$1048576,'Mobile-Data'!$C$9:$C$1048576,'Mobile-Detail Calcs'!$B25,'Mobile-Data'!$G$9:$G$1048576,'Mobile-Detail Calcs'!D$21)","v":0},{"$f":"SUMIFS('Mobile-Data'!$H$9:$H$1048576,'Mobile-Data'!$C$9:$C$1048576,'Mobile-Detail Calcs'!$B25,'Mobile-Data'!$G$9:$G$1048576,'Mobile-Detail Calcs'!E$21)","v":0},{"$f":"SUMIFS('Mobile-Data'!$H$9:$H$1048576,'Mobile-Data'!$C$9:$C$1048576,'Mobile-Detail Calcs'!$B25,'Mobile-Data'!$G$9:$G$1048576,'Mobile-Detail Calcs'!F$21)","v":0},{"$f":"SUMIFS('Mobile-Data'!$H$9:$H$1048576,'Mobile-Data'!$C$9:$C$1048576,'Mobile-Detail Calcs'!$B25,'Mobile-Data'!$G$9:$G$1048576,'Mobile-Detail Calcs'!G$21)","v":0},{"$f":"SUMIFS('Mobile-Data'!$H$9:$H$1048576,'Mobile-Data'!$C$9:$C$1048576,'Mobile-Detail Calcs'!$B25,'Mobile-Data'!$G$9:$G$1048576,'Mobile-Detail Calcs'!H$21)","v":0},{"$f":"SUMIFS('Mobile-Data'!$H$9:$H$1048576,'Mobile-Data'!$C$9:$C$1048576,'Mobile-Detail Calcs'!$B25,'Mobile-Data'!$G$9:$G$1048576,'Mobile-Detail Calcs'!I$21)","v":0},{"$f":"SUMIFS('Mobile-Data'!$H$9:$H$1048576,'Mobile-Data'!$C$9:$C$1048576,'Mobile-Detail Calcs'!$B25,'Mobile-Data'!$G$9:$G$1048576,'Mobile-Detail Calcs'!J$21)","v":0},{"$f":"SUMIFS('Mobile-Data'!$H$9:$H$1048576,'Mobile-Data'!$C$9:$C$1048576,'Mobile-Detail Calcs'!$B25,'Mobile-Data'!$G$9:$G$1048576,'Mobile-Detail Calcs'!K$21)","v":0},{"$f":"SUMIFS('Mobile-Data'!$H$9:$H$1048576,'Mobile-Data'!$C$9:$C$1048576,'Mobile-Detail Calcs'!$B25,'Mobile-Data'!$G$9:$G$1048576,'Mobile-Detail Calcs'!L$21)","v":0},{"$f":"SUMIFS('Mobile-Data'!$H$9:$H$1048576,'Mobile-Data'!$C$9:$C$1048576,'Mobile-Detail Calcs'!$B25,'Mobile-Data'!$G$9:$G$1048576,'Mobile-Detail Calcs'!M$21)","v":0}]
[null,{"$f":"'Background Controls'!I8","v":0},{"$f":"SUMIFS('Mobile-Data'!$H$9:$H$1048576,'Mobile-Data'!$C$9:$C$1048576,'Mobile-Detail Calcs'!$B26,'Mobile-Data'!$G$9:$G$1048576,'Mobile-Detail Calcs'!C$21)","v":0},{"$f":"SUMIFS('Mobile-Data'!$H$9:$H$1048576,'Mobile-Data'!$C$9:$C$1048576,'Mobile-Detail Calcs'!$B26,'Mobile-Data'!$G$9:$G$1048576,'Mobile-Detail Calcs'!D$21)","v":0},{"$f":"SUMIFS('Mobile-Data'!$H$9:$H$1048576,'Mobile-Data'!$C$9:$C$1048576,'Mobile-Detail Calcs'!$B26,'Mobile-Data'!$G$9:$G$1048576,'Mobile-Detail Calcs'!E$21)","v":0},{"$f":"SUMIFS('Mobile-Data'!$H$9:$H$1048576,'Mobile-Data'!$C$9:$C$1048576,'Mobile-Detail Calcs'!$B26,'Mobile-Data'!$G$9:$G$1048576,'Mobile-Detail Calcs'!F$21)","v":0},{"$f":"SUMIFS('Mobile-Data'!$H$9:$H$1048576,'Mobile-Data'!$C$9:$C$1048576,'Mobile-Detail Calcs'!$B26,'Mobile-Data'!$G$9:$G$1048576,'Mobile-Detail Calcs'!G$21)","v":0},{"$f":"SUMIFS('Mobile-Data'!$H$9:$H$1048576,'Mobile-Data'!$C$9:$C$1048576,'Mobile-Detail Calcs'!$B26,'Mobile-Data'!$G$9:$G$1048576,'Mobile-Detail Calcs'!H$21)","v":0},{"$f":"SUMIFS('Mobile-Data'!$H$9:$H$1048576,'Mobile-Data'!$C$9:$C$1048576,'Mobile-Detail Calcs'!$B26,'Mobile-Data'!$G$9:$G$1048576,'Mobile-Detail Calcs'!I$21)","v":0},{"$f":"SUMIFS('Mobile-Data'!$H$9:$H$1048576,'Mobile-Data'!$C$9:$C$1048576,'Mobile-Detail Calcs'!$B26,'Mobile-Data'!$G$9:$G$1048576,'Mobile-Detail Calcs'!J$21)","v":0},{"$f":"SUMIFS('Mobile-Data'!$H$9:$H$1048576,'Mobile-Data'!$C$9:$C$1048576,'Mobile-Detail Calcs'!$B26,'Mobile-Data'!$G$9:$G$1048576,'Mobile-Detail Calcs'!K$21)","v":0},{"$f":"SUMIFS('Mobile-Data'!$H$9:$H$1048576,'Mobile-Data'!$C$9:$C$1048576,'Mobile-Detail Calcs'!$B26,'Mobile-Data'!$G$9:$G$1048576,'Mobile-Detail Calcs'!L$21)","v":0},{"$f":"SUMIFS('Mobile-Data'!$H$9:$H$1048576,'Mobile-Data'!$C$9:$C$1048576,'Mobile-Detail Calcs'!$B26,'Mobile-Data'!$G$9:$G$1048576,'Mobile-Detail Calcs'!M$21)","v":0}]
[null,{"$f":"'Background Controls'!I9","v":0},{"$f":"SUMIFS('Mobile-Data'!$H$9:$H$1048576,'Mobile-Data'!$C$9:$C$1048576,'Mobile-Detail Calcs'!$B27,'Mobile-Data'!$G$9:$G$1048576,'Mobile-Detail Calcs'!C$21)","v":0},{"$f":"SUMIFS('Mobile-Data'!$H$9:$H$1048576,'Mobile-Data'!$C$9:$C$1048576,'Mobile-Detail Calcs'!$B27,'Mobile-Data'!$G$9:$G$1048576,'Mobile-Detail Calcs'!D$21)","v":0},{"$f":"SUMIFS('Mobile-Data'!$H$9:$H$1048576,'Mobile-Data'!$C$9:$C$1048576,'Mobile-Detail Calcs'!$B27,'Mobile-Data'!$G$9:$G$1048576,'Mobile-Detail Calcs'!E$21)","v":0},{"$f":"SUMIFS('Mobile-Data'!$H$9:$H$1048576,'Mobile-Data'!$C$9:$C$1048576,'Mobile-Detail Calcs'!$B27,'Mobile-Data'!$G$9:$G$1048576,'Mobile-Detail Calcs'!F$21)","v":0},{"$f":"SUMIFS('Mobile-Data'!$H$9:$H$1048576,'Mobile-Data'!$C$9:$C$1048576,'Mobile-Detail Calcs'!$B27,'Mobile-Data'!$G$9:$G$1048576,'Mobile-Detail Calcs'!G$21)","v":0},{"$f":"SUMIFS('Mobile-Data'!$H$9:$H$1048576,'Mobile-Data'!$C$9:$C$1048576,'Mobile-Detail Calcs'!$B27,'Mobile-Data'!$G$9:$G$1048576,'Mobile-Detail Calcs'!H$21)","v":0},{"$f":"SUMIFS('Mobile-Data'!$H$9:$H$1048576,'Mobile-Data'!$C$9:$C$1048576,'Mobile-Detail Calcs'!$B27,'Mobile-Data'!$G$9:$G$1048576,'Mobile-Detail Calcs'!I$21)","v":0},{"$f":"SUMIFS('Mobile-Data'!$H$9:$H$1048576,'Mobile-Data'!$C$9:$C$1048576,'Mobile-Detail Calcs'!$B27,'Mobile-Data'!$G$9:$G$1048576,'Mobile-Detail Calcs'!J$21)","v":0},{"$f":"SUMIFS('Mobile-Data'!$H$9:$H$1048576,'Mobile-Data'!$C$9:$C$1048576,'Mobile-Detail Calcs'!$B27,'Mobile-Data'!$G$9:$G$1048576,'Mobile-Detail Calcs'!K$21)","v":0},{"$f":"SUMIFS('Mobile-Data'!$H$9:$H$1048576,'Mobile-Data'!$C$9:$C$1048576,'Mobile-Detail Calcs'!$B27,'Mobile-Data'!$G$9:$G$1048576,'Mobile-Detail Calcs'!L$21)","v":0},{"$f":"SUMIFS('Mobile-Data'!$H$9:$H$1048576,'Mobile-Data'!$C$9:$C$1048576,'Mobile-Detail Calcs'!$B27,'Mobile-Data'!$G$9:$G$1048576,'Mobile-Detail Calcs'!M$21)","v":0}]
[null,{"$f":"'Background Controls'!I10","v":0},{"$f":"SUMIFS('Mobile-Data'!$H$9:$H$1048576,'Mobile-Data'!$C$9:$C$1048576,'Mobile-Detail Calcs'!$B28,'Mobile-Data'!$G$9:$G$1048576,'Mobile-Detail Calcs'!C$21)","v":0},{"$f":"SUMIFS('Mobile-Data'!$H$9:$H$1048576,'Mobile-Data'!$C$9:$C$1048576,'Mobile-Detail Calcs'!$B28,'Mobile-Data'!$G$9:$G$1048576,'Mobile-Detail Calcs'!D$21)","v":0},{"$f":"SUMIFS('Mobile-Data'!$H$9:$H$1048576,'Mobile-Data'!$C$9:$C$1048576,'Mobile-Detail Calcs'!$B28,'Mobile-Data'!$G$9:$G$1048576,'Mobile-Detail Calcs'!E$21)","v":0},{"$f":"SUMIFS('Mobile-Data'!$H$9:$H$1048576,'Mobile-Data'!$C$9:$C$1048576,'Mobile-Detail Calcs'!$B28,'Mobile-Data'!$G$9:$G$1048576,'Mobile-Detail Calcs'!F$21)","v":0},{"$f":"SUMIFS('Mobile-Data'!$H$9:$H$1048576,'Mobile-Data'!$C$9:$C$1048576,'Mobile-Detail Calcs'!$B28,'Mobile-Data'!$G$9:$G$1048576,'Mobile-Detail Calcs'!G$21)","v":0},{"$f":"SUMIFS('Mobile-Data'!$H$9:$H$1048576,'Mobile-Data'!$C$9:$C$1048576,'Mobile-Detail Calcs'!$B28,'Mobile-Data'!$G$9:$G$1048576,'Mobile-Detail Calcs'!H$21)","v":0},{"$f":"SUMIFS('Mobile-Data'!$H$9:$H$1048576,'Mobile-Data'!$C$9:$C$1048576,'Mobile-Detail Calcs'!$B28,'Mobile-Data'!$G$9:$G$1048576,'Mobile-Detail Calcs'!I$21)","v":0},{"$f":"SUMIFS('Mobile-Data'!$H$9:$H$1048576,'Mobile-Data'!$C$9:$C$1048576,'Mobile-Detail Calcs'!$B28,'Mobile-Data'!$G$9:$G$1048576,'Mobile-Detail Calcs'!J$21)","v":0},{"$f":"SUMIFS('Mobile-Data'!$H$9:$H$1048576,'Mobile-Data'!$C$9:$C$1048576,'Mobile-Detail Calcs'!$B28,'Mobile-Data'!$G$9:$G$1048576,'Mobile-Detail Calcs'!K$21)","v":0},{"$f":"SUMIFS('Mobile-Data'!$H$9:$H$1048576,'Mobile-Data'!$C$9:$C$1048576,'Mobile-Detail Calcs'!$B28,'Mobile-Data'!$G$9:$G$1048576,'Mobile-Detail Calcs'!L$21)","v":0},{"$f":"SUMIFS('Mobile-Data'!$H$9:$H$1048576,'Mobile-Data'!$C$9:$C$1048576,'Mobile-Detail Calcs'!$B28,'Mobile-Data'!$G$9:$G$1048576,'Mobile-Detail Calcs'!M$21)","v":0}]
[null,{"$f":"'Background Controls'!I11","v":0},{"$f":"SUMIFS('Mobile-Data'!$H$9:$H$1048576,'Mobile-Data'!$C$9:$C$1048576,'Mobile-Detail Calcs'!$B29,'Mobile-Data'!$G$9:$G$1048576,'Mobile-Detail Calcs'!C$21)","v":0},{"$f":"SUMIFS('Mobile-Data'!$H$9:$H$1048576,'Mobile-Data'!$C$9:$C$1048576,'Mobile-Detail Calcs'!$B29,'Mobile-Data'!$G$9:$G$1048576,'Mobile-Detail Calcs'!D$21)","v":0},{"$f":"SUMIFS('Mobile-Data'!$H$9:$H$1048576,'Mobile-Data'!$C$9:$C$1048576,'Mobile-Detail Calcs'!$B29,'Mobile-Data'!$G$9:$G$1048576,'Mobile-Detail Calcs'!E$21)","v":0},{"$f":"SUMIFS('Mobile-Data'!$H$9:$H$1048576,'Mobile-Data'!$C$9:$C$1048576,'Mobile-Detail Calcs'!$B29,'Mobile-Data'!$G$9:$G$1048576,'Mobile-Detail Calcs'!F$21)","v":0},{"$f":"SUMIFS('Mobile-Data'!$H$9:$H$1048576,'Mobile-Data'!$C$9:$C$1048576,'Mobile-Detail Calcs'!$B29,'Mobile-Data'!$G$9:$G$1048576,'Mobile-Detail Calcs'!G$21)","v":0},{"$f":"SUMIFS('Mobile-Data'!$H$9:$H$1048576,'Mobile-Data'!$C$9:$C$1048576,'Mobile-Detail Calcs'!$B29,'Mobile-Data'!$G$9:$G$1048576,'Mobile-Detail Calcs'!H$21)","v":0},{"$f":"SUMIFS('Mobile-Data'!$H$9:$H$1048576,'Mobile-Data'!$C$9:$C$1048576,'Mobile-Detail Calcs'!$B29,'Mobile-Data'!$G$9:$G$1048576,'Mobile-Detail Calcs'!I$21)","v":0},{"$f":"SUMIFS('Mobile-Data'!$H$9:$H$1048576,'Mobile-Data'!$C$9:$C$1048576,'Mobile-Detail Calcs'!$B29,'Mobile-Data'!$G$9:$G$1048576,'Mobile-Detail Calcs'!J$21)","v":0},{"$f":"SUMIFS('Mobile-Data'!$H$9:$H$1048576,'Mobile-Data'!$C$9:$C$1048576,'Mobile-Detail Calcs'!$B29,'Mobile-Data'!$G$9:$G$1048576,'Mobile-Detail Calcs'!K$21)","v":0},{"$f":"SUMIFS('Mobile-Data'!$H$9:$H$1048576,'Mobile-Data'!$C$9:$C$1048576,'Mobile-Detail Calcs'!$B29,'Mobile-Data'!$G$9:$G$1048576,'Mobile-Detail Calcs'!L$21)","v":0},{"$f":"SUMIFS('Mobile-Data'!$H$9:$H$1048576,'Mobile-Data'!$C$9:$C$1048576,'Mobile-Detail Calcs'!$B29,'Mobile-Data'!$G$9:$G$1048576,'Mobile-Detail Calcs'!M$21)","v":0}]
[null,{"$f":"'Background Controls'!I12","v":0},{"$f":"SUMIFS('Mobile-Data'!$H$9:$H$1048576,'Mobile-Data'!$C$9:$C$1048576,'Mobile-Detail Calcs'!$B30,'Mobile-Data'!$G$9:$G$1048576,'Mobile-Detail Calcs'!C$21)","v":0},{"$f":"SUMIFS('Mobile-Data'!$H$9:$H$1048576,'Mobile-Data'!$C$9:$C$1048576,'Mobile-Detail Calcs'!$B30,'Mobile-Data'!$G$9:$G$1048576,'Mobile-Detail Calcs'!D$21)","v":0},{"$f":"SUMIFS('Mobile-Data'!$H$9:$H$1048576,'Mobile-Data'!$C$9:$C$1048576,'Mobile-Detail Calcs'!$B30,'Mobile-Data'!$G$9:$G$1048576,'Mobile-Detail Calcs'!E$21)","v":0},{"$f":"SUMIFS('Mobile-Data'!$H$9:$H$1048576,'Mobile-Data'!$C$9:$C$1048576,'Mobile-Detail Calcs'!$B30,'Mobile-Data'!$G$9:$G$1048576,'Mobile-Detail Calcs'!F$21)","v":0},{"$f":"SUMIFS('Mobile-Data'!$H$9:$H$1048576,'Mobile-Data'!$C$9:$C$1048576,'Mobile-Detail Calcs'!$B30,'Mobile-Data'!$G$9:$G$1048576,'Mobile-Detail Calcs'!G$21)","v":0},{"$f":"SUMIFS('Mobile-Data'!$H$9:$H$1048576,'Mobile-Data'!$C$9:$C$1048576,'Mobile-Detail Calcs'!$B30,'Mobile-Data'!$G$9:$G$1048576,'Mobile-Detail Calcs'!H$21)","v":0},{"$f":"SUMIFS('Mobile-Data'!$H$9:$H$1048576,'Mobile-Data'!$C$9:$C$1048576,'Mobile-Detail Calcs'!$B30,'Mobile-Data'!$G$9:$G$1048576,'Mobile-Detail Calcs'!I$21)","v":0},{"$f":"SUMIFS('Mobile-Data'!$H$9:$H$1048576,'Mobile-Data'!$C$9:$C$1048576,'Mobile-Detail Calcs'!$B30,'Mobile-Data'!$G$9:$G$1048576,'Mobile-Detail Calcs'!J$21)","v":0},{"$f":"SUMIFS('Mobile-Data'!$H$9:$H$1048576,'Mobile-Data'!$C$9:$C$1048576,'Mobile-Detail Calcs'!$B30,'Mobile-Data'!$G$9:$G$1048576,'Mobile-Detail Calcs'!K$21)","v":0},{"$f":"SUMIFS('Mobile-Data'!$H$9:$H$1048576,'Mobile-Data'!$C$9:$C$1048576,'Mobile-Detail Calcs'!$B30,'Mobile-Data'!$G$9:$G$1048576,'Mobile-Detail Calcs'!L$21)","v":0},{"$f":"SUMIFS('Mobile-Data'!$H$9:$H$1048576,'Mobile-Data'!$C$9:$C$1048576,'Mobile-Detail Calcs'!$B30,'Mobile-Data'!$G$9:$G$1048576,'Mobile-Detail Calcs'!M$21)","v":0}]
[null,{"$f":"'Background Controls'!I13","v":0},{"$f":"SUMIFS('Mobile-Data'!$H$9:$H$1048576,'Mobile-Data'!$C$9:$C$1048576,'Mobile-Detail Calcs'!$B31,'Mobile-Data'!$G$9:$G$1048576,'Mobile-Detail Calcs'!C$21)","v":0},{"$f":"SUMIFS('Mobile-Data'!$H$9:$H$1048576,'Mobile-Data'!$C$9:$C$1048576,'Mobile-Detail Calcs'!$B31,'Mobile-Data'!$G$9:$G$1048576,'Mobile-Detail Calcs'!D$21)","v":0},{"$f":"SUMIFS('Mobile-Data'!$H$9:$H$1048576,'Mobile-Data'!$C$9:$C$1048576,'Mobile-Detail Calcs'!$B31,'Mobile-Data'!$G$9:$G$1048576,'Mobile-Detail Calcs'!E$21)","v":0},{"$f":"SUMIFS('Mobile-Data'!$H$9:$H$1048576,'Mobile-Data'!$C$9:$C$1048576,'Mobile-Detail Calcs'!$B31,'Mobile-Data'!$G$9:$G$1048576,'Mobile-Detail Calcs'!F$21)","v":0},{"$f":"SUMIFS('Mobile-Data'!$H$9:$H$1048576,'Mobile-Data'!$C$9:$C$1048576,'Mobile-Detail Calcs'!$B31,'Mobile-Data'!$G$9:$G$1048576,'Mobile-Detail Calcs'!G$21)","v":0},{"$f":"SUMIFS('Mobile-Data'!$H$9:$H$1048576,'Mobile-Data'!$C$9:$C$1048576,'Mobile-Detail Calcs'!$B31,'Mobile-Data'!$G$9:$G$1048576,'Mobile-Detail Calcs'!H$21)","v":0},{"$f":"SUMIFS('Mobile-Data'!$H$9:$H$1048576,'Mobile-Data'!$C$9:$C$1048576,'Mobile-Detail Calcs'!$B31,'Mobile-Data'!$G$9:$G$1048576,'Mobile-Detail Calcs'!I$21)","v":0},{"$f":"SUMIFS('Mobile-Data'!$H$9:$H$1048576,'Mobile-Data'!$C$9:$C$1048576,'Mobile-Detail Calcs'!$B31,'Mobile-Data'!$G$9:$G$1048576,'Mobile-Detail Calcs'!J$21)","v":0},{"$f":"SUMIFS('Mobile-Data'!$H$9:$H$1048576,'Mobile-Data'!$C$9:$C$1048576,'Mobile-Detail Calcs'!$B31,'Mobile-Data'!$G$9:$G$1048576,'Mobile-Detail Calcs'!K$21)","v":0},{"$f":"SUMIFS('Mobile-Data'!$H$9:$H$1048576,'Mobile-Data'!$C$9:$C$1048576,'Mobile-Detail Calcs'!$B31,'Mobile-Data'!$G$9:$G$1048576,'Mobile-Detail Calcs'!L$21)","v":0},{"$f":"SUMIFS('Mobile-Data'!$H$9:$H$1048576,'Mobile-Data'!$C$9:$C$1048576,'Mobile-Detail Calcs'!$B31,'Mobile-Data'!$G$9:$G$1048576,'Mobile-Detail Calcs'!M$21)","v":0}]
[null,{"$f":"'Background Controls'!I14","v":0},{"$f":"SUMIFS('Mobile-Data'!$H$9:$H$1048576,'Mobile-Data'!$C$9:$C$1048576,'Mobile-Detail Calcs'!$B32,'Mobile-Data'!$G$9:$G$1048576,'Mobile-Detail Calcs'!C$21)","v":0},{"$f":"SUMIFS('Mobile-Data'!$H$9:$H$1048576,'Mobile-Data'!$C$9:$C$1048576,'Mobile-Detail Calcs'!$B32,'Mobile-Data'!$G$9:$G$1048576,'Mobile-Detail Calcs'!D$21)","v":0},{"$f":"SUMIFS('Mobile-Data'!$H$9:$H$1048576,'Mobile-Data'!$C$9:$C$1048576,'Mobile-Detail Calcs'!$B32,'Mobile-Data'!$G$9:$G$1048576,'Mobile-Detail Calcs'!E$21)","v":0},{"$f":"SUMIFS('Mobile-Data'!$H$9:$H$1048576,'Mobile-Data'!$C$9:$C$1048576,'Mobile-Detail Calcs'!$B32,'Mobile-Data'!$G$9:$G$1048576,'Mobile-Detail Calcs'!F$21)","v":0},{"$f":"SUMIFS('Mobile-Data'!$H$9:$H$1048576,'Mobile-Data'!$C$9:$C$1048576,'Mobile-Detail Calcs'!$B32,'Mobile-Data'!$G$9:$G$1048576,'Mobile-Detail Calcs'!G$21)","v":0},{"$f":"SUMIFS('Mobile-Data'!$H$9:$H$1048576,'Mobile-Data'!$C$9:$C$1048576,'Mobile-Detail Calcs'!$B32,'Mobile-Data'!$G$9:$G$1048576,'Mobile-Detail Calcs'!H$21)","v":0},{"$f":"SUMIFS('Mobile-Data'!$H$9:$H$1048576,'Mobile-Data'!$C$9:$C$1048576,'Mobile-Detail Calcs'!$B32,'Mobile-Data'!$G$9:$G$1048576,'Mobile-Detail Calcs'!I$21)","v":0},{"$f":"SUMIFS('Mobile-Data'!$H$9:$H$1048576,'Mobile-Data'!$C$9:$C$1048576,'Mobile-Detail Calcs'!$B32,'Mobile-Data'!$G$9:$G$1048576,'Mobile-Detail Calcs'!J$21)","v":0},{"$f":"SUMIFS('Mobile-Data'!$H$9:$H$1048576,'Mobile-Data'!$C$9:$C$1048576,'Mobile-Detail Calcs'!$B32,'Mobile-Data'!$G$9:$G$1048576,'Mobile-Detail Calcs'!K$21)","v":0},{"$f":"SUMIFS('Mobile-Data'!$H$9:$H$1048576,'Mobile-Data'!$C$9:$C$1048576,'Mobile-Detail Calcs'!$B32,'Mobile-Data'!$G$9:$G$1048576,'Mobile-Detail Calcs'!L$21)","v":0},{"$f":"SUMIFS('Mobile-Data'!$H$9:$H$1048576,'Mobile-Data'!$C$9:$C$1048576,'Mobile-Detail Calcs'!$B32,'Mobile-Data'!$G$9:$G$1048576,'Mobile-Detail Calcs'!M$21)","v":0}]
[null,{"$f":"'Background Controls'!I15","v":0},{"$f":"SUMIFS('Mobile-Data'!$H$9:$H$1048576,'Mobile-Data'!$C$9:$C$1048576,'Mobile-Detail Calcs'!$B33,'Mobile-Data'!$G$9:$G$1048576,'Mobile-Detail Calcs'!C$21)","v":0},{"$f":"SUMIFS('Mobile-Data'!$H$9:$H$1048576,'Mobile-Data'!$C$9:$C$1048576,'Mobile-Detail Calcs'!$B33,'Mobile-Data'!$G$9:$G$1048576,'Mobile-Detail Calcs'!D$21)","v":0},{"$f":"SUMIFS('Mobile-Data'!$H$9:$H$1048576,'Mobile-Data'!$C$9:$C$1048576,'Mobile-Detail Calcs'!$B33,'Mobile-Data'!$G$9:$G$1048576,'Mobile-Detail Calcs'!E$21)","v":0},{"$f":"SUMIFS('Mobile-Data'!$H$9:$H$1048576,'Mobile-Data'!$C$9:$C$1048576,'Mobile-Detail Calcs'!$B33,'Mobile-Data'!$G$9:$G$1048576,'Mobile-Detail Calcs'!F$21)","v":0},{"$f":"SUMIFS('Mobile-Data'!$H$9:$H$1048576,'Mobile-Data'!$C$9:$C$1048576,'Mobile-Detail Calcs'!$B33,'Mobile-Data'!$G$9:$G$1048576,'Mobile-Detail Calcs'!G$21)","v":0},{"$f":"SUMIFS('Mobile-Data'!$H$9:$H$1048576,'Mobile-Data'!$C$9:$C$1048576,'Mobile-Detail Calcs'!$B33,'Mobile-Data'!$G$9:$G$1048576,'Mobile-Detail Calcs'!H$21)","v":0},{"$f":"SUMIFS('Mobile-Data'!$H$9:$H$1048576,'Mobile-Data'!$C$9:$C$1048576,'Mobile-Detail Calcs'!$B33,'Mobile-Data'!$G$9:$G$1048576,'Mobile-Detail Calcs'!I$21)","v":0},{"$f":"SUMIFS('Mobile-Data'!$H$9:$H$1048576,'Mobile-Data'!$C$9:$C$1048576,'Mobile-Detail Calcs'!$B33,'Mobile-Data'!$G$9:$G$1048576,'Mobile-Detail Calcs'!J$21)","v":0},{"$f":"SUMIFS('Mobile-Data'!$H$9:$H$1048576,'Mobile-Data'!$C$9:$C$1048576,'Mobile-Detail Calcs'!$B33,'Mobile-Data'!$G$9:$G$1048576,'Mobile-Detail Calcs'!K$21)","v":0},{"$f":"SUMIFS('Mobile-Data'!$H$9:$H$1048576,'Mobile-Data'!$C$9:$C$1048576,'Mobile-Detail Calcs'!$B33,'Mobile-Data'!$G$9:$G$1048576,'Mobile-Detail Calcs'!L$21)","v":0},{"$f":"SUMIFS('Mobile-Data'!$H$9:$H$1048576,'Mobile-Data'!$C$9:$C$1048576,'Mobile-Detail Calcs'!$B33,'Mobile-Data'!$G$9:$G$1048576,'Mobile-Detail Calcs'!M$21)","v":0}]
[null,{"$f":"'Background Controls'!I16","v":0},{"$f":"SUMIFS('Mobile-Data'!$H$9:$H$1048576,'Mobile-Data'!$C$9:$C$1048576,'Mobile-Detail Calcs'!$B34,'Mobile-Data'!$G$9:$G$1048576,'Mobile-Detail Calcs'!C$21)","v":0},{"$f":"SUMIFS('Mobile-Data'!$H$9:$H$1048576,'Mobile-Data'!$C$9:$C$1048576,'Mobile-Detail Calcs'!$B34,'Mobile-Data'!$G$9:$G$1048576,'Mobile-Detail Calcs'!D$21)","v":0},{"$f":"SUMIFS('Mobile-Data'!$H$9:$H$1048576,'Mobile-Data'!$C$9:$C$1048576,'Mobile-Detail Calcs'!$B34,'Mobile-Data'!$G$9:$G$1048576,'Mobile-Detail Calcs'!E$21)","v":0},{"$f":"SUMIFS('Mobile-Data'!$H$9:$H$1048576,'Mobile-Data'!$C$9:$C$1048576,'Mobile-Detail Calcs'!$B34,'Mobile-Data'!$G$9:$G$1048576,'Mobile-Detail Calcs'!F$21)","v":0},{"$f":"SUMIFS('Mobile-Data'!$H$9:$H$1048576,'Mobile-Data'!$C$9:$C$1048576,'Mobile-Detail Calcs'!$B34,'Mobile-Data'!$G$9:$G$1048576,'Mobile-Detail Calcs'!G$21)","v":0},{"$f":"SUMIFS('Mobile-Data'!$H$9:$H$1048576,'Mobile-Data'!$C$9:$C$1048576,'Mobile-Detail Calcs'!$B34,'Mobile-Data'!$G$9:$G$1048576,'Mobile-Detail Calcs'!H$21)","v":0},{"$f":"SUMIFS('Mobile-Data'!$H$9:$H$1048576,'Mobile-Data'!$C$9:$C$1048576,'Mobile-Detail Calcs'!$B34,'Mobile-Data'!$G$9:$G$1048576,'Mobile-Detail Calcs'!I$21)","v":0},{"$f":"SUMIFS('Mobile-Data'!$H$9:$H$1048576,'Mobile-Data'!$C$9:$C$1048576,'Mobile-Detail Calcs'!$B34,'Mobile-Data'!$G$9:$G$1048576,'Mobile-Detail Calcs'!J$21)","v":0},{"$f":"SUMIFS('Mobile-Data'!$H$9:$H$1048576,'Mobile-Data'!$C$9:$C$1048576,'Mobile-Detail Calcs'!$B34,'Mobile-Data'!$G$9:$G$1048576,'Mobile-Detail Calcs'!K$21)","v":0},{"$f":"SUMIFS('Mobile-Data'!$H$9:$H$1048576,'Mobile-Data'!$C$9:$C$1048576,'Mobile-Detail Calcs'!$B34,'Mobile-Data'!$G$9:$G$1048576,'Mobile-Detail Calcs'!L$21)","v":0},{"$f":"SUMIFS('Mobile-Data'!$H$9:$H$1048576,'Mobile-Data'!$C$9:$C$1048576,'Mobile-Detail Calcs'!$B34,'Mobile-Data'!$G$9:$G$1048576,'Mobile-Detail Calcs'!M$21)","v":0}]
[null,{"$f":"'Background Controls'!I17","v":0},{"$f":"SUMIFS('Mobile-Data'!$H$9:$H$1048576,'Mobile-Data'!$C$9:$C$1048576,'Mobile-Detail Calcs'!$B35,'Mobile-Data'!$G$9:$G$1048576,'Mobile-Detail Calcs'!C$21)","v":0},{"$f":"SUMIFS('Mobile-Data'!$H$9:$H$1048576,'Mobile-Data'!$C$9:$C$1048576,'Mobile-Detail Calcs'!$B35,'Mobile-Data'!$G$9:$G$1048576,'Mobile-Detail Calcs'!D$21)","v":0},{"$f":"SUMIFS('Mobile-Data'!$H$9:$H$1048576,'Mobile-Data'!$C$9:$C$1048576,'Mobile-Detail Calcs'!$B35,'Mobile-Data'!$G$9:$G$1048576,'Mobile-Detail Calcs'!E$21)","v":0},{"$f":"SUMIFS('Mobile-Data'!$H$9:$H$1048576,'Mobile-Data'!$C$9:$C$1048576,'Mobile-Detail Calcs'!$B35,'Mobile-Data'!$G$9:$G$1048576,'Mobile-Detail Calcs'!F$21)","v":0},{"$f":"SUMIFS('Mobile-Data'!$H$9:$H$1048576,'Mobile-Data'!$C$9:$C$1048576,'Mobile-Detail Calcs'!$B35,'Mobile-Data'!$G$9:$G$1048576,'Mobile-Detail Calcs'!G$21)","v":0},{"$f":"SUMIFS('Mobile-Data'!$H$9:$H$1048576,'Mobile-Data'!$C$9:$C$1048576,'Mobile-Detail Calcs'!$B35,'Mobile-Data'!$G$9:$G$1048576,'Mobile-Detail Calcs'!H$21)","v":0},{"$f":"SUMIFS('Mobile-Data'!$H$9:$H$1048576,'Mobile-Data'!$C$9:$C$1048576,'Mobile-Detail Calcs'!$B35,'Mobile-Data'!$G$9:$G$1048576,'Mobile-Detail Calcs'!I$21)","v":0},{"$f":"SUMIFS('Mobile-Data'!$H$9:$H$1048576,'Mobile-Data'!$C$9:$C$1048576,'Mobile-Detail Calcs'!$B35,'Mobile-Data'!$G$9:$G$1048576,'Mobile-Detail Calcs'!J$21)","v":0},{"$f":"SUMIFS('Mobile-Data'!$H$9:$H$1048576,'Mobile-Data'!$C$9:$C$1048576,'Mobile-Detail Calcs'!$B35,'Mobile-Data'!$G$9:$G$1048576,'Mobile-Detail Calcs'!K$21)","v":0},{"$f":"SUMIFS('Mobile-Data'!$H$9:$H$1048576,'Mobile-Data'!$C$9:$C$1048576,'Mobile-Detail Calcs'!$B35,'Mobile-Data'!$G$9:$G$1048576,'Mobile-Detail Calcs'!L$21)","v":0},{"$f":"SUMIFS('Mobile-Data'!$H$9:$H$1048576,'Mobile-Data'!$C$9:$C$1048576,'Mobile-Detail Calcs'!$B35,'Mobile-Data'!$G$9:$G$1048576,'Mobile-Detail Calcs'!M$21)","v":0}]
[null,{"$f":"'Background Controls'!I18","v":0},{"$f":"SUMIFS('Mobile-Data'!$H$9:$H$1048576,'Mobile-Data'!$C$9:$C$1048576,'Mobile-Detail Calcs'!$B36,'Mobile-Data'!$G$9:$G$1048576,'Mobile-Detail Calcs'!C$21)","v":0},{"$f":"SUMIFS('Mobile-Data'!$H$9:$H$1048576,'Mobile-Data'!$C$9:$C$1048576,'Mobile-Detail Calcs'!$B36,'Mobile-Data'!$G$9:$G$1048576,'Mobile-Detail Calcs'!D$21)","v":0},{"$f":"SUMIFS('Mobile-Data'!$H$9:$H$1048576,'Mobile-Data'!$C$9:$C$1048576,'Mobile-Detail Calcs'!$B36,'Mobile-Data'!$G$9:$G$1048576,'Mobile-Detail Calcs'!E$21)","v":0},{"$f":"SUMIFS('Mobile-Data'!$H$9:$H$1048576,'Mobile-Data'!$C$9:$C$1048576,'Mobile-Detail Calcs'!$B36,'Mobile-Data'!$G$9:$G$1048576,'Mobile-Detail Calcs'!F$21)","v":0},{"$f":"SUMIFS('Mobile-Data'!$H$9:$H$1048576,'Mobile-Data'!$C$9:$C$1048576,'Mobile-Detail Calcs'!$B36,'Mobile-Data'!$G$9:$G$1048576,'Mobile-Detail Calcs'!G$21)","v":0},{"$f":"SUMIFS('Mobile-Data'!$H$9:$H$1048576,'Mobile-Data'!$C$9:$C$1048576,'Mobile-Detail Calcs'!$B36,'Mobile-Data'!$G$9:$G$1048576,'Mobile-Detail Calcs'!H$21)","v":0},{"$f":"SUMIFS('Mobile-Data'!$H$9:$H$1048576,'Mobile-Data'!$C$9:$C$1048576,'Mobile-Detail Calcs'!$B36,'Mobile-Data'!$G$9:$G$1048576,'Mobile-Detail Calcs'!I$21)","v":0},{"$f":"SUMIFS('Mobile-Data'!$H$9:$H$1048576,'Mobile-Data'!$C$9:$C$1048576,'Mobile-Detail Calcs'!$B36,'Mobile-Data'!$G$9:$G$1048576,'Mobile-Detail Calcs'!J$21)","v":0},{"$f":"SUMIFS('Mobile-Data'!$H$9:$H$1048576,'Mobile-Data'!$C$9:$C$1048576,'Mobile-Detail Calcs'!$B36,'Mobile-Data'!$G$9:$G$1048576,'Mobile-Detail Calcs'!K$21)","v":0},{"$f":"SUMIFS('Mobile-Data'!$H$9:$H$1048576,'Mobile-Data'!$C$9:$C$1048576,'Mobile-Detail Calcs'!$B36,'Mobile-Data'!$G$9:$G$1048576,'Mobile-Detail Calcs'!L$21)","v":0},{"$f":"SUMIFS('Mobile-Data'!$H$9:$H$1048576,'Mobile-Data'!$C$9:$C$1048576,'Mobile-Detail Calcs'!$B36,'Mobile-Data'!$G$9:$G$1048576,'Mobile-Detail Calcs'!M$21)","v":0}]
[null,{"$f":"'Background Controls'!I19","v":0},{"$f":"SUMIFS('Mobile-Data'!$H$9:$H$1048576,'Mobile-Data'!$C$9:$C$1048576,'Mobile-Detail Calcs'!$B37,'Mobile-Data'!$G$9:$G$1048576,'Mobile-Detail Calcs'!C$21)","v":0},{"$f":"SUMIFS('Mobile-Data'!$H$9:$H$1048576,'Mobile-Data'!$C$9:$C$1048576,'Mobile-Detail Calcs'!$B37,'Mobile-Data'!$G$9:$G$1048576,'Mobile-Detail Calcs'!D$21)","v":0},{"$f":"SUMIFS('Mobile-Data'!$H$9:$H$1048576,'Mobile-Data'!$C$9:$C$1048576,'Mobile-Detail Calcs'!$B37,'Mobile-Data'!$G$9:$G$1048576,'Mobile-Detail Calcs'!E$21)","v":0},{"$f":"SUMIFS('Mobile-Data'!$H$9:$H$1048576,'Mobile-Data'!$C$9:$C$1048576,'Mobile-Detail Calcs'!$B37,'Mobile-Data'!$G$9:$G$1048576,'Mobile-Detail Calcs'!F$21)","v":0},{"$f":"SUMIFS('Mobile-Data'!$H$9:$H$1048576,'Mobile-Data'!$C$9:$C$1048576,'Mobile-Detail Calcs'!$B37,'Mobile-Data'!$G$9:$G$1048576,'Mobile-Detail Calcs'!G$21)","v":0},{"$f":"SUMIFS('Mobile-Data'!$H$9:$H$1048576,'Mobile-Data'!$C$9:$C$1048576,'Mobile-Detail Calcs'!$B37,'Mobile-Data'!$G$9:$G$1048576,'Mobile-Detail Calcs'!H$21)","v":0},{"$f":"SUMIFS('Mobile-Data'!$H$9:$H$1048576,'Mobile-Data'!$C$9:$C$1048576,'Mobile-Detail Calcs'!$B37,'Mobile-Data'!$G$9:$G$1048576,'Mobile-Detail Calcs'!I$21)","v":0},{"$f":"SUMIFS('Mobile-Data'!$H$9:$H$1048576,'Mobile-Data'!$C$9:$C$1048576,'Mobile-Detail Calcs'!$B37,'Mobile-Data'!$G$9:$G$1048576,'Mobile-Detail Calcs'!J$21)","v":0},{"$f":"SUMIFS('Mobile-Data'!$H$9:$H$1048576,'Mobile-Data'!$C$9:$C$1048576,'Mobile-Detail Calcs'!$B37,'Mobile-Data'!$G$9:$G$1048576,'Mobile-Detail Calcs'!K$21)","v":0},{"$f":"SUMIFS('Mobile-Data'!$H$9:$H$1048576,'Mobile-Data'!$C$9:$C$1048576,'Mobile-Detail Calcs'!$B37,'Mobile-Data'!$G$9:$G$1048576,'Mobile-Detail Calcs'!L$21)","v":0},{"$f":"SUMIFS('Mobile-Data'!$H$9:$H$1048576,'Mobile-Data'!$C$9:$C$1048576,'Mobile-Detail Calcs'!$B37,'Mobile-Data'!$G$9:$G$1048576,'Mobile-Detail Calcs'!M$21)","v":0}]
[null,{"$f":"'Background Controls'!I20","v":0},{"$f":"SUMIFS('Mobile-Data'!$H$9:$H$1048576,'Mobile-Data'!$C$9:$C$1048576,'Mobile-Detail Calcs'!$B38,'Mobile-Data'!$G$9:$G$1048576,'Mobile-Detail Calcs'!C$21)","v":0},{"$f":"SUMIFS('Mobile-Data'!$H$9:$H$1048576,'Mobile-Data'!$C$9:$C$1048576,'Mobile-Detail Calcs'!$B38,'Mobile-Data'!$G$9:$G$1048576,'Mobile-Detail Calcs'!D$21)","v":0},{"$f":"SUMIFS('Mobile-Data'!$H$9:$H$1048576,'Mobile-Data'!$C$9:$C$1048576,'Mobile-Detail Calcs'!$B38,'Mobile-Data'!$G$9:$G$1048576,'Mobile-Detail Calcs'!E$21)","v":0},{"$f":"SUMIFS('Mobile-Data'!$H$9:$H$1048576,'Mobile-Data'!$C$9:$C$1048576,'Mobile-Detail Calcs'!$B38,'Mobile-Data'!$G$9:$G$1048576,'Mobile-Detail Calcs'!F$21)","v":0},{"$f":"SUMIFS('Mobile-Data'!$H$9:$H$1048576,'Mobile-Data'!$C$9:$C$1048576,'Mobile-Detail Calcs'!$B38,'Mobile-Data'!$G$9:$G$1048576,'Mobile-Detail Calcs'!G$21)","v":0},{"$f":"SUMIFS('Mobile-Data'!$H$9:$H$1048576,'Mobile-Data'!$C$9:$C$1048576,'Mobile-Detail Calcs'!$B38,'Mobile-Data'!$G$9:$G$1048576,'Mobile-Detail Calcs'!H$21)","v":0},{"$f":"SUMIFS('Mobile-Data'!$H$9:$H$1048576,'Mobile-Data'!$C$9:$C$1048576,'Mobile-Detail Calcs'!$B38,'Mobile-Data'!$G$9:$G$1048576,'Mobile-Detail Calcs'!I$21)","v":0},{"$f":"SUMIFS('Mobile-Data'!$H$9:$H$1048576,'Mobile-Data'!$C$9:$C$1048576,'Mobile-Detail Calcs'!$B38,'Mobile-Data'!$G$9:$G$1048576,'Mobile-Detail Calcs'!J$21)","v":0},{"$f":"SUMIFS('Mobile-Data'!$H$9:$H$1048576,'Mobile-Data'!$C$9:$C$1048576,'Mobile-Detail Calcs'!$B38,'Mobile-Data'!$G$9:$G$1048576,'Mobile-Detail Calcs'!K$21)","v":0},{"$f":"SUMIFS('Mobile-Data'!$H$9:$H$1048576,'Mobile-Data'!$C$9:$C$1048576,'Mobile-Detail Calcs'!$B38,'Mobile-Data'!$G$9:$G$1048576,'Mobile-Detail Calcs'!L$21)","v":0},{"$f":"SUMIFS('Mobile-Data'!$H$9:$H$1048576,'Mobile-Data'!$C$9:$C$1048576,'Mobile-Detail Calcs'!$B38,'Mobile-Data'!$G$9:$G$1048576,'Mobile-Detail Calcs'!M$21)","v":0}]
[null,{"$f":"'Background Controls'!I21","v":0},{"$f":"SUMIFS('Mobile-Data'!$H$9:$H$1048576,'Mobile-Data'!$C$9:$C$1048576,'Mobile-Detail Calcs'!$B39,'Mobile-Data'!$G$9:$G$1048576,'Mobile-Detail Calcs'!C$21)","v":0},{"$f":"SUMIFS('Mobile-Data'!$H$9:$H$1048576,'Mobile-Data'!$C$9:$C$1048576,'Mobile-Detail Calcs'!$B39,'Mobile-Data'!$G$9:$G$1048576,'Mobile-Detail Calcs'!D$21)","v":0},{"$f":"SUMIFS('Mobile-Data'!$H$9:$H$1048576,'Mobile-Data'!$C$9:$C$1048576,'Mobile-Detail Calcs'!$B39,'Mobile-Data'!$G$9:$G$1048576,'Mobile-Detail Calcs'!E$21)","v":0},{"$f":"SUMIFS('Mobile-Data'!$H$9:$H$1048576,'Mobile-Data'!$C$9:$C$1048576,'Mobile-Detail Calcs'!$B39,'Mobile-Data'!$G$9:$G$1048576,'Mobile-Detail Calcs'!F$21)","v":0},{"$f":"SUMIFS('Mobile-Data'!$H$9:$H$1048576,'Mobile-Data'!$C$9:$C$1048576,'Mobile-Detail Calcs'!$B39,'Mobile-Data'!$G$9:$G$1048576,'Mobile-Detail Calcs'!G$21)","v":0},{"$f":"SUMIFS('Mobile-Data'!$H$9:$H$1048576,'Mobile-Data'!$C$9:$C$1048576,'Mobile-Detail Calcs'!$B39,'Mobile-Data'!$G$9:$G$1048576,'Mobile-Detail Calcs'!H$21)","v":0},{"$f":"SUMIFS('Mobile-Data'!$H$9:$H$1048576,'Mobile-Data'!$C$9:$C$1048576,'Mobile-Detail Calcs'!$B39,'Mobile-Data'!$G$9:$G$1048576,'Mobile-Detail Calcs'!I$21)","v":0},{"$f":"SUMIFS('Mobile-Data'!$H$9:$H$1048576,'Mobile-Data'!$C$9:$C$1048576,'Mobile-Detail Calcs'!$B39,'Mobile-Data'!$G$9:$G$1048576,'Mobile-Detail Calcs'!J$21)","v":0},{"$f":"SUMIFS('Mobile-Data'!$H$9:$H$1048576,'Mobile-Data'!$C$9:$C$1048576,'Mobile-Detail Calcs'!$B39,'Mobile-Data'!$G$9:$G$1048576,'Mobile-Detail Calcs'!K$21)","v":0},{"$f":"SUMIFS('Mobile-Data'!$H$9:$H$1048576,'Mobile-Data'!$C$9:$C$1048576,'Mobile-Detail Calcs'!$B39,'Mobile-Data'!$G$9:$G$1048576,'Mobile-Detail Calcs'!L$21)","v":0},{"$f":"SUMIFS('Mobile-Data'!$H$9:$H$1048576,'Mobile-Data'!$C$9:$C$1048576,'Mobile-Detail Calcs'!$B39,'Mobile-Data'!$G$9:$G$1048576,'Mobile-Detail Calcs'!M$21)","v":0}]
[null,{"$f":"'Background Controls'!I22","v":0},{"$f":"SUMIFS('Mobile-Data'!$H$9:$H$1048576,'Mobile-Data'!$C$9:$C$1048576,'Mobile-Detail Calcs'!$B40,'Mobile-Data'!$G$9:$G$1048576,'Mobile-Detail Calcs'!C$21)","v":0},{"$f":"SUMIFS('Mobile-Data'!$H$9:$H$1048576,'Mobile-Data'!$C$9:$C$1048576,'Mobile-Detail Calcs'!$B40,'Mobile-Data'!$G$9:$G$1048576,'Mobile-Detail Calcs'!D$21)","v":0},{"$f":"SUMIFS('Mobile-Data'!$H$9:$H$1048576,'Mobile-Data'!$C$9:$C$1048576,'Mobile-Detail Calcs'!$B40,'Mobile-Data'!$G$9:$G$1048576,'Mobile-Detail Calcs'!E$21)","v":0},{"$f":"SUMIFS('Mobile-Data'!$H$9:$H$1048576,'Mobile-Data'!$C$9:$C$1048576,'Mobile-Detail Calcs'!$B40,'Mobile-Data'!$G$9:$G$1048576,'Mobile-Detail Calcs'!F$21)","v":0},{"$f":"SUMIFS('Mobile-Data'!$H$9:$H$1048576,'Mobile-Data'!$C$9:$C$1048576,'Mobile-Detail Calcs'!$B40,'Mobile-Data'!$G$9:$G$1048576,'Mobile-Detail Calcs'!G$21)","v":0},{"$f":"SUMIFS('Mobile-Data'!$H$9:$H$1048576,'Mobile-Data'!$C$9:$C$1048576,'Mobile-Detail Calcs'!$B40,'Mobile-Data'!$G$9:$G$1048576,'Mobile-Detail Calcs'!H$21)","v":0},{"$f":"SUMIFS('Mobile-Data'!$H$9:$H$1048576,'Mobile-Data'!$C$9:$C$1048576,'Mobile-Detail Calcs'!$B40,'Mobile-Data'!$G$9:$G$1048576,'Mobile-Detail Calcs'!I$21)","v":0},{"$f":"SUMIFS('Mobile-Data'!$H$9:$H$1048576,'Mobile-Data'!$C$9:$C$1048576,'Mobile-Detail Calcs'!$B40,'Mobile-Data'!$G$9:$G$1048576,'Mobile-Detail Calcs'!J$21)","v":0},{"$f":"SUMIFS('Mobile-Data'!$H$9:$H$1048576,'Mobile-Data'!$C$9:$C$1048576,'Mobile-Detail Calcs'!$B40,'Mobile-Data'!$G$9:$G$1048576,'Mobile-Detail Calcs'!K$21)","v":0},{"$f":"SUMIFS('Mobile-Data'!$H$9:$H$1048576,'Mobile-Data'!$C$9:$C$1048576,'Mobile-Detail Calcs'!$B40,'Mobile-Data'!$G$9:$G$1048576,'Mobile-Detail Calcs'!L$21)","v":0},{"$f":"SUMIFS('Mobile-Data'!$H$9:$H$1048576,'Mobile-Data'!$C$9:$C$1048576,'Mobile-Detail Calcs'!$B40,'Mobile-Data'!$G$9:$G$1048576,'Mobile-Detail Calcs'!M$21)","v":0}]
[null,{"$f":"'Background Controls'!I23","v":0},{"$f":"SUMIFS('Mobile-Data'!$H$9:$H$1048576,'Mobile-Data'!$C$9:$C$1048576,'Mobile-Detail Calcs'!$B41,'Mobile-Data'!$G$9:$G$1048576,'Mobile-Detail Calcs'!C$21)","v":0},{"$f":"SUMIFS('Mobile-Data'!$H$9:$H$1048576,'Mobile-Data'!$C$9:$C$1048576,'Mobile-Detail Calcs'!$B41,'Mobile-Data'!$G$9:$G$1048576,'Mobile-Detail Calcs'!D$21)","v":0},{"$f":"SUMIFS('Mobile-Data'!$H$9:$H$1048576,'Mobile-Data'!$C$9:$C$1048576,'Mobile-Detail Calcs'!$B41,'Mobile-Data'!$G$9:$G$1048576,'Mobile-Detail Calcs'!E$21)","v":0},{"$f":"SUMIFS('Mobile-Data'!$H$9:$H$1048576,'Mobile-Data'!$C$9:$C$1048576,'Mobile-Detail Calcs'!$B41,'Mobile-Data'!$G$9:$G$1048576,'Mobile-Detail Calcs'!F$21)","v":0},{"$f":"SUMIFS('Mobile-Data'!$H$9:$H$1048576,'Mobile-Data'!$C$9:$C$1048576,'Mobile-Detail Calcs'!$B41,'Mobile-Data'!$G$9:$G$1048576,'Mobile-Detail Calcs'!G$21)","v":0},{"$f":"SUMIFS('Mobile-Data'!$H$9:$H$1048576,'Mobile-Data'!$C$9:$C$1048576,'Mobile-Detail Calcs'!$B41,'Mobile-Data'!$G$9:$G$1048576,'Mobile-Detail Calcs'!H$21)","v":0},{"$f":"SUMIFS('Mobile-Data'!$H$9:$H$1048576,'Mobile-Data'!$C$9:$C$1048576,'Mobile-Detail Calcs'!$B41,'Mobile-Data'!$G$9:$G$1048576,'Mobile-Detail Calcs'!I$21)","v":0},{"$f":"SUMIFS('Mobile-Data'!$H$9:$H$1048576,'Mobile-Data'!$C$9:$C$1048576,'Mobile-Detail Calcs'!$B41,'Mobile-Data'!$G$9:$G$1048576,'Mobile-Detail Calcs'!J$21)","v":0},{"$f":"SUMIFS('Mobile-Data'!$H$9:$H$1048576,'Mobile-Data'!$C$9:$C$1048576,'Mobile-Detail Calcs'!$B41,'Mobile-Data'!$G$9:$G$1048576,'Mobile-Detail Calcs'!K$21)","v":0},{"$f":"SUMIFS('Mobile-Data'!$H$9:$H$1048576,'Mobile-Data'!$C$9:$C$1048576,'Mobile-Detail Calcs'!$B41,'Mobile-Data'!$G$9:$G$1048576,'Mobile-Detail Calcs'!L$21)","v":0},{"$f":"SUMIFS('Mobile-Data'!$H$9:$H$1048576,'Mobile-Data'!$C$9:$C$1048576,'Mobile-Detail Calcs'!$B41,'Mobile-Data'!$G$9:$G$1048576,'Mobile-Detail Calcs'!M$21)","v":0}]
[null,{"$f":"'Background Controls'!I24","v":0},{"$f":"SUMIFS('Mobile-Data'!$H$9:$H$1048576,'Mobile-Data'!$C$9:$C$1048576,'Mobile-Detail Calcs'!$B42,'Mobile-Data'!$G$9:$G$1048576,'Mobile-Detail Calcs'!C$21)","v":0},{"$f":"SUMIFS('Mobile-Data'!$H$9:$H$1048576,'Mobile-Data'!$C$9:$C$1048576,'Mobile-Detail Calcs'!$B42,'Mobile-Data'!$G$9:$G$1048576,'Mobile-Detail Calcs'!D$21)","v":0},{"$f":"SUMIFS('Mobile-Data'!$H$9:$H$1048576,'Mobile-Data'!$C$9:$C$1048576,'Mobile-Detail Calcs'!$B42,'Mobile-Data'!$G$9:$G$1048576,'Mobile-Detail Calcs'!E$21)","v":0},{"$f":"SUMIFS('Mobile-Data'!$H$9:$H$1048576,'Mobile-Data'!$C$9:$C$1048576,'Mobile-Detail Calcs'!$B42,'Mobile-Data'!$G$9:$G$1048576,'Mobile-Detail Calcs'!F$21)","v":0},{"$f":"SUMIFS('Mobile-Data'!$H$9:$H$1048576,'Mobile-Data'!$C$9:$C$1048576,'Mobile-Detail Calcs'!$B42,'Mobile-Data'!$G$9:$G$1048576,'Mobile-Detail Calcs'!G$21)","v":0},{"$f":"SUMIFS('Mobile-Data'!$H$9:$H$1048576,'Mobile-Data'!$C$9:$C$1048576,'Mobile-Detail Calcs'!$B42,'Mobile-Data'!$G$9:$G$1048576,'Mobile-Detail Calcs'!H$21)","v":0},{"$f":"SUMIFS('Mobile-Data'!$H$9:$H$1048576,'Mobile-Data'!$C$9:$C$1048576,'Mobile-Detail Calcs'!$B42,'Mobile-Data'!$G$9:$G$1048576,'Mobile-Detail Calcs'!I$21)","v":0},{"$f":"SUMIFS('Mobile-Data'!$H$9:$H$1048576,'Mobile-Data'!$C$9:$C$1048576,'Mobile-Detail Calcs'!$B42,'Mobile-Data'!$G$9:$G$1048576,'Mobile-Detail Calcs'!J$21)","v":0},{"$f":"SUMIFS('Mobile-Data'!$H$9:$H$1048576,'Mobile-Data'!$C$9:$C$1048576,'Mobile-Detail Calcs'!$B42,'Mobile-Data'!$G$9:$G$1048576,'Mobile-Detail Calcs'!K$21)","v":0},{"$f":"SUMIFS('Mobile-Data'!$H$9:$H$1048576,'Mobile-Data'!$C$9:$C$1048576,'Mobile-Detail Calcs'!$B42,'Mobile-Data'!$G$9:$G$1048576,'Mobile-Detail Calcs'!L$21)","v":0},{"$f":"SUMIFS('Mobile-Data'!$H$9:$H$1048576,'Mobile-Data'!$C$9:$C$1048576,'Mobile-Detail Calcs'!$B42,'Mobile-Data'!$G$9:$G$1048576,'Mobile-Detail Calcs'!M$21)","v":0}]
[null,"Total",{"$f":"SUM(C23:C42)","v":0},0,0,0,0,0,0,0,0,0,0]
[]
["Energy Use by Department and Fuel Type"]
["This table summarizes energy use by department (MMBtu)."]
[null,null,"Gasoline","Diesel","Biodiesel (B5)","Biodiesel (B20)","Ethanol (E85)","CNG","LNG","LPG","Residual Fuel","Jet Fuel","Aviation Gasoline","TOTAL"]
["Dstart",{"$f":"'Background Controls'!I5","v":0},{"$f":"C23*VLOOKUP(C$47, mob_fuel_CO2_efs, 5, FALSE)","v":0},0,0,0,0,0,0,0,0,0,0,{"$f":"SUM(C48:M48)","v":0}]
[null,{"$f":"'Background Controls'!I6","v":0},{"$f":"C24*VLOOKUP(C$47, mob_fuel_CO2_efs, 5, FALSE)","v":0},0,0,0,0,0,0,0,0,0,0,{"$f":"SUM(C49:M49)","v":0}]
[null,{"$f":"'Background Controls'!I7","v":0},{"$f":"C25*VLOOKUP(C$47, mob_fuel_CO2_efs, 5, FALSE)","v":0},0,0,0,0,0,0,0,0,0,0,0]
[null,{"$f":"'Background Controls'!I8","v":0},{"$f":"C26*VLOOKUP(C$47, mob_fuel_CO2_efs, 5, FALSE)","v":0},0,0,0,0,0,0,0,0,0,0,0]
[null,{"$f":"'Background Controls'!I9","v":0},{"$f":"C27*VLOOKUP(C$47, mob_fuel_CO2_efs, 5, FALSE)","v":0},0,0,0,0,0,0,0,0,0,0,0]
[null,{"$f":"'Background Controls'!I10","v":0},{"$f":"C28*VLOOKUP(C$47, mob_fuel_CO2_efs, 5, FALSE)","v":0},0,0,0,0,0,0,0,0,0,0,0]
[null,{"$f":"'Background Controls'!I11","v":0},{"$f":"C29*VLOOKUP(C$47, mob_fuel_CO2_efs, 5, FALSE)","v":0},0,0,0,0,0,0,0,0,0,0,0]
[null,{"$f":"'Background Controls'!I12","v":0},{"$f":"C30*VLOOKUP(C$47, mob_fuel_CO2_efs, 5, FALSE)","v":0},0,0,0,0,0,0,0,0,0,0,0]
[null,{"$f":"'Background Controls'!I13","v":0},{"$f":"C31*VLOOKUP(C$47, mob_fuel_CO2_efs, 5, FALSE)","v":0},0,0,0,0,0,0,0,0,0,0,0]
[null,{"$f":"'Background Controls'!I14","v":0},{"$f":"C32*VLOOKUP(C$47, mob_fuel_CO2_efs, 5, FALSE)","v":0},0,0,0,0,0,0,0,0,0,0,0]
[null,{"$f":"'Background Controls'!I15","v":0},{"$f":"C33*VLOOKUP(C$47, mob_fuel_CO2_efs, 5, FALSE)","v":0},0,0,0,0,0,0,0,0,0,0,0]
[null,{"$f":"'Background Controls'!I16","v":0},{"$f":"C34*VLOOKUP(C$47, mob_fuel_CO2_efs, 5, FALSE)","v":0},0,0,0,0,0,0,0,0,0,0,0]
[null,{"$f":"'Background Controls'!I17","v":0},{"$f":"C35*VLOOKUP(C$47, mob_fuel_CO2_efs, 5, FALSE)","v":0},0,0,0,0,0,0,0,0,0,0,0]
[null,{"$f":"'Background Controls'!I18","v":0},{"$f":"C36*VLOOKUP(C$47, mob_fuel_CO2_efs, 5, FALSE)","v":0},0,0,0,0,0,0,0,0,0,0,0]
[null,{"$f":"'Background Controls'!I19","v":0},{"$f":"C37*VLOOKUP(C$47, mob_fuel_CO2_efs, 5, FALSE)","v":0},0,0,0,0,0,0,0,0,0,0,0]
[null,{"$f":"'Background Controls'!I20","v":0},{"$f":"C38*VLOOKUP(C$47, mob_fuel_CO2_efs, 5, FALSE)","v":0},0,0,0,0,0,0,0,0,0,0,0]
[null,{"$f":"'Background Controls'!I21","v":0},{"$f":"C39*VLOOKUP(C$47, mob_fuel_CO2_efs, 5, FALSE)","v":0},0,0,0,0,0,0,0,0,0,0,0]
[null,{"$f":"'Background Controls'!I22","v":0},{"$f":"C40*VLOOKUP(C$47, mob_fuel_CO2_efs, 5, FALSE)","v":0},0,0,0,0,0,0,0,0,0,0,0]
[null,{"$f":"'Background Controls'!I23","v":0},{"$f":"C41*VLOOKUP(C$47, mob_fuel_CO2_efs, 5, FALSE)","v":0},0,0,0,0,0,0,0,0,0,0,0]
[null,{"$f":"'Background Controls'!I24","v":0},{"$f":"C42*VLOOKUP(C$47, mob_fuel_CO2_efs, 5, FALSE)","v":0},0,0,0,0,0,0,0,0,0,0,0]
[null,"Total",{"$f":"SUM(C48:C67)","v":0},0,0,0,0,0,0,0,0,0,0,0]
[]
[]
["CO2 Calculations"]
[]
["Gross CO2 Emissions"]
["CO2 Emissions (MT) = Fuel use × kg CO2/unit of fuel × MT/kg"]
[null,null,"Gasoline","Diesel","Biodiesel (B5)","Biodiesel (B20)","Ethanol (E85)","CNG","LNG","LPG","Residual Fuel","Jet Fuel","Aviation Gasoline","TOTAL"]
[null,"EF: kg CO2/gal (or g.g.e.)",{"$f":"VLOOKUP(C21,mob_fuel_CO2_efs,2,FALSE)","v":8.7799999999999994},10.210000000000001,{"$f":"VLOOKUP(E21,mob_fuel_CO2_efs,2,FALSE)","v":10.172000000000001},10.058000000000002,6.2045000000000003,6.8401800000000001,4.46,5.79,11.8,9.57,8.31]
["Dstart",{"$f":"B23","v":0},{"$f":"C23*C$76*kg_mt","v":0},0,0,0,0,0,0,0,0,0,0,{"$f":"SUM(C77:M77)","v":0}]
[null,{"$f":"B24","v":0},{"$f":"C24*C$76*kg_mt","v":0},0,0,0,0,0,0,0,0,0,0,{"$f":"SUM(C78:M78)","v":0}]
[null,0,{"$f":"C25*C$76*kg_mt","v":0},0,0,0,0,0,0,0,0,0,0,0]
[null,0,{"$f":"C26*C$76*kg_mt","v":0},0,0,0,0,0,0,0,0,0,0,0]
[null,0,{"$f":"C27*C$76*kg_mt","v":0},0,0,0,0,0,0,0,0,0,0,0]
[null,0,{"$f":"C28*C$76*kg_mt","v":0},0,0,0,0,0,0,0,0,0,0,0]
[null,0,{"$f":"C29*C$76*kg_mt","v":0},0,0,0,0,0,0,0,0,0,0,0]
[null,0,{"$f":"C30*C$76*kg_mt","v":0},0,0,0,0,0,0,0,0,0,0,0]
[null,0,{"$f":"C31*C$76*kg_mt","v":0},0,0,0,0,0,0,0,0,0,0,0]
[null,0,{"$f":"C32*C$76*kg_mt","v":0},0,0,0,0,0,0,0,0,0,0,0]
[null,0,{"$f":"C33*C$76*kg_mt","v":0},0,0,0,0,0,0,0,0,0,0,0]
[null,0,{"$f":"C34*C$76*kg_mt","v":0},0,0,0,0,0,0,0,0,0,0,0]
[null,0,{"$f":"C35*C$76*kg_mt","v":0},0,0,0,0,0,0,0,0,0,0,0]
[null,0,{"$f":"C36*C$76*kg_mt","v":0},0,0,0,0,0,0,0,0,0,0,0]
[null,0,{"$f":"C37*C$76*kg_mt","v":0},0,0,0,0,0,0,0,0,0,0,0]
[null,0,{"$f":"C38*C$76*kg_mt","v":0},0,0,0,0,0,0,0,0,0,0,0]
[null,0,{"$f":"C39*C$76*kg_mt","v":0},0,0,0,0,0,0,0,0,0,0,0]
[null,0,{"$f":"C40*C$76*kg_mt","v":0},0,0,0,0,0,0,0,0,0,0,0]
[null,0,{"$f":"C41*C$76*kg_mt","v":0},0,0,0,0,0,0,0,0,0,0,0]
[null,0,{"$f":"C42*C$76*kg_mt","v":0},0,0,0,0,0,0,0,0,0,0,0]
[null,"Total",{"$f":"SUM(C77:C96)","v":0},0,0,0,0,0,0,0,0,0,0,0]
[]
["Biogenic CO2 Emissions"]
["Biogenic CO2 (MT) = Fuel use × Biogenic kg CO2/unit of fuel × MT/kg"]
[null,null,"Gasoline","Diesel","Biodiesel (B5)","Biodiesel (B20)","Ethanol (E85)","CNG","LNG","LPG","Residual Fuel","Jet Fuel","Aviation Gasoline","TOTAL"]
[null,"EF: kg CO2/gal (or g.g.e.)",{"$f":"VLOOKUP(C101,mob_fuel_CO2_efs,3,FALSE)","v":0},0,0.47249999999999998,1.89,4.8875000000000002,0,0,0,0,0,0]
["Dstart",{"$f":"B77","v":0},{"$f":"C23*C$102*kg_mt","v":0},0,0,0,0,0,0,0,0,0,0,{"$f":"SUM(C103:M103)","v":0}]
[null,{"$f":"B78","v":0},{"$f":"C24*C$102*kg_mt","v":0},0,0,0,0,0,0,0,0,0,0,{"$f":"SUM(C104:M104)","v":0}]
[null,0,{"$f":"C25*C$102*kg_mt","v":0},0,0,0,0,0,0,0,0,0,0,0]
[null,0,{"$f":"C26*C$102*kg_mt","v":0},0,0,0,0,0,0,0,0,0,0,0]
[null,0,{"$f":"C27*C$102*kg_mt","v":0},0,0,0,0,0,0,0,0,0,0,0]
[null,0,{"$f":"C28*C$102*kg_mt","v":0},0,0,0,0,0,0,0,0,0,0,0]
[null,0,{"$f":"C29*C$102*kg_mt","v":0},0,0,0,0,0,0,0,0,0,0,0]
[null,0,{"$f":"C30*C$102*kg_mt","v":0},0,0,0,0,0,0,0,0,0,0,0]
[null,0,{"$f":"C31*C$102*kg_mt","v":0},0,0,0,0,0,0,0,0,0,0,0]
[null,0,{"$f":"C32*C$102*kg_mt","v":0},0,0,0,0,0,0,0,0,0,0,0]
[null,0,{"$f":"C33*C$102*kg_mt","v":0},0,0,0,0,0,0,0,0,0,0,0]
[null,0,{"$f":"C34*C$102*kg_mt","v":0},0,0,0,0,0,0,0,0,0,0,0]
[null,0,{"$f":"C35*C$102*kg_mt","v":0},0,0,0,0,0,0,0,0,0,0,0]
[null,0,{"$f":"C36*C$102*kg_mt","v":0},0,0,0,0,0,0,0,0,0,0,0]
[null,0,{"$f":"C37*C$102*kg_mt","v":0},0,0,0,0,0,0,0,0,0,0,0]
[null,0,{"$f":"C38*C$102*kg_mt","v":0},0,0,0,0,0,0,0,0,0,0,0]
[null,0,{"$f":"C39*C$102*kg_mt","v":0},0,0,0,0,0,0,0,0,0,0,0]
[null,0,{"$f":"C40*C$102*kg_mt","v":0},0,0,0,0,0,0,0,0,0,0,0]
[null,0,{"$f":"C41*C$102*kg_mt","v":0},0,0,0,0,0,0,0,0,0,0,0]
[null,0,{"$f":"C42*C$102*kg_mt","v":0},0,0,0,0,0,0,0,0,0,0,0]
[null,"Total",{"$f":"SUM(C103:C122)","v":0},0,0,0,0,0,0,0,0,0,0,0]
[]
[]
["Net CO2 Emissions"]
["Net CO2 Emissions (MT) = Gross CO2 Emissions - Biogenic CO2 Emissions"]
[null,null,"Gasoline","Diesel","Biodiesel (B5)","Biodiesel (B20)","Ethanol (E85)","CNG","LNG","LPG","Residual Fuel","Jet Fuel","Aviation Gasoline","TOTAL"]
["Dstart",{"$f":"B103","v":0},{"$f":"C77-C103","v":0},0,0,0,0,0,0,0,0,0,0,{"$f":"SUM(C129:M129)","v":0}]
[null,{"$f":"B104","v":0},{"$f":"C78-C104","v":0},0,0,0,0,0,0,0,0,0,0,{"$f":"SUM(C130:M130)","v":0}]
[null,0,{"$f":"C79-C105","v":0},0,0,0,0,0,0,0,0,0,0,0]
[null,0,{"$f":"C80-C106","v":0},0,0,0,0,0,0,0,0,0,0,0]
[null,0,{"$f":"C81-C107","v":0},0,0,0,0,0,0,0,0,0,0,0]
[null,0,{"$f":"C82-C108","v":0},0,0,0,0,0,0,0,0,0,0,0]
[null,0,{"$f":"C83-C109","v":0},0,0,0,0,0,0,0,0,0,0,0]
[null,0,{"$f":"C84-C110","v":0},0,0,0,0,0,0,0,0,0,0,0]
[null,0,{"$f":"C85-C111","v":0},0,0,0,0,0,0,0,0,0,0,0]
[null,0,{"$f":"C86-C112","v":0},0,0,0,0,0,0,0,0,0,0,0]
[null,0,{"$f":"C87-C113","v":0},0,0,0,0,0,0,0,0,0,0,0]
[null,0,{"$f":"C88-C114","v":0},0,0,0,0,0,0,0,0,0,0,0]
[null,0,{"$f":"C89-C115","v":0},0,0,0,0,0,0,0,0,0,0,0]
[null,0,{"$f":"C90-C116","v":0},0,0,0,0,0,0,0,0,0,0,0]
[null,0,{"$f":"C91-C117","v":0},0,0,0,0,0,0,0,0,0,0,0]
[null,0,{"$f":"C92-C118","v":0},0,0,0,0,0,0,0,0,0,0,0]
[null,0,{"$f":"C93-C119","v":0},0,0,0,0,0,0,0,0,0,0,0]
[null,0,{"$f":"C94-C120","v":0},0,0,0,0,0,0,0,0,0,0,0]
[null,0,{"$f":"C95-C121","v":0},0,0,0,0,0,0,0,0,0,0,0]
[null,0,{"$f":"C96-C122","v":0},0,0,0,0,0,0,0,0,0,0,0]
[null,"Total",{"$f":"SUM(C129:C148)","v":0},0,0,0,0,0,0,0,0,0,0,{"$f":"SUM(C149:M149)","v":0}]
[]
[]
[]
["Non-CO2 Calculations"]
[]
[]
[]
[]
[]
[]
[]
[]
[null,"Current department:",0,null,null,"The \"Update Calculations\" function on the Mobile-Entry sheet automatically runs these calculations for each department."]
[null,null,null,null,null,"To view the calculations below for an individual department, select the department from the drop-down list in the shaded cell."]
["1) Highway Vehicles"]
[null,"VMT by Model Year and Vehicle Type",null,null,null,null,null,null,null,null,"CH4 Emissions by Model Year and Vehicle Type",null,null,null,null,null,null,null,null,"N2O Emissions by Model Year and Vehicle Type"]
[null,"Vehicle activity data by Model Year and vehicle type for the selected department (miles).",null,null,null,null,null,null,null,null,"CH4 Emissions = VMT × Highway Emissions Factor (g/mi) × MT/g × GWP CH4",null,null,null,null,null,null,null,null,"N2O emissions = VMT × Highway Emissions Factor (g/mi) × MT/g × GWP N2O"]
[null,null,"Passenger Car","Light Truck (Vans, Pickup Trucks, SUVs)","Heavy-Duty Vehicle","Passenger Car","Light Truck (Vans, Pickup Trucks, SUVs)","Heavy-Duty Vehicle","TOTAL",null,null,"Passenger Car","Light Truck (Vans, Pickup Trucks, SUVs)","Heavy-Duty Vehicle","Passenger Car","Light Truck (Vans, Pickup Trucks, SUVs)","Heavy-Duty Vehicle","TOTAL",null,null,"Passenger Car","Light Truck (Vans, Pickup Trucks, SUVs)","Heavy-Duty Vehicle","Passenger Car","Light Truck (Vans, Pickup Trucks, SUVs)","Heavy-Duty Vehicle","TOTAL"]
[null,"Model Year","Gasoline","Gasoline","Gasoline","Diesel","Diesel","Diesel",null,null,"MY","Gasoline","Gasoline","Gasoline","Diesel","Diesel","Diesel",null,null,"MY","Gasoline","Gasoline","Gasoline","Diesel","Diesel","Diesel"]
[null,"1980 & earlier",{"$f":"SUMIFS('Mobile-Data'!$I$9:$I$1048576,'Mobile-Data'!$D$9:$D$1048576,\"<=1980\",'Mobile-Data'!$E$9:$E$1048576,'Mobile-Detail Calcs'!C$167,'Mobile-Data'!$G$9:$G$1048576,'Mobile-Detail Calcs'!C$168,'Mobile-Data'!$C$9:$C$1048576,'Mobile-Detail Calcs'!$C$162)","v":0},{"$f":"SUMIFS('Mobile-Data'!$I$9:$I$1048576,'Mobile-Data'!$D$9:$D$1048576,\"<=1980\",'Mobile-Data'!$E$9:$E$1048576,'Mobile-Detail Calcs'!D$167,'Mobile-Data'!$G$9:$G$1048576,'Mobile-Detail Calcs'!D$168,'Mobile-Data'!$C$9:$C$1048576,'Mobile-Detail Calcs'!$C$162)","v":0},{"$f":"SUMIFS('Mobile-Data'!$I$9:$I$1048576,'Mobile-Data'!$D$9:$D$1048576,\"<=1980\",'Mobile-Data'!$E$9:$E$1048576,'Mobile-Detail Calcs'!E$167,'Mobile-Data'!$G$9:$G$1048576,'Mobile-Detail Calcs'!E$168,'Mobile-Data'!$C$9:$C$1048576,'Mobile-Detail Calcs'!$C$162)","v":0},{"$f":"SUMIFS('Mobile-Data'!$I$9:$I$1048576,'Mobile-Data'!$D$9:$D$1048576,\"<=1980\",'Mobile-Data'!$E$9:$E$1048576,'Mobile-Detail Calcs'!F$167,'Mobile-Data'!$G$9:$G$1048576,'Mobile-Detail Calcs'!F$168,'Mobile-Data'!$C$9:$C$1048576,'Mobile-Detail Calcs'!$C$162)","v":0},{"$f":"SUMIFS('Mobile-Data'!$I$9:$I$1048576,'Mobile-Data'!$D$9:$D$1048576,\"<=1980\",'Mobile-Data'!$E$9:$E$1048576,'Mobile-Detail Calcs'!G$167,'Mobile-Data'!$G$9:$G$1048576,'Mobile-Detail Calcs'!G$168,'Mobile-Data'!$C$9:$C$1048576,'Mobile-Detail Calcs'!$C$162)","v":0},{"$f":"SUMIFS('Mobile-Data'!$I$9:$I$1048576,'Mobile-Data'!$D$9:$D$1048576,\"<=1980\",'Mobile-Data'!$E$9:$E$1048576,'Mobile-Detail Calcs'!H$167,'Mobile-Data'!$G$9:$G$1048576,'Mobile-Detail Calcs'!H$168,'Mobile-Data'!$C$9:$C$1048576,'Mobile-Detail Calcs'!$C$162)","v":0},{"$f":"SUM(C169:H169)","v":0},null,"1980 & earlier",{"$f":"C169*Factors!C178*g_kg*kg_mt*GWP_CH4","v":0},{"$f":"D169*Factors!D178*g_kg*kg_mt*GWP_CH4","v":0},{"$f":"E169*Factors!E178*g_kg*kg_mt*GWP_CH4","v":0},{"$f":"F169*Factors!F178*g_kg*kg_mt*GWP_CH4","v":0},{"$f":"G169*Factors!G178*g_kg*kg_mt*GWP_CH4","v":0},{"$f":"H169*Factors!H178*g_kg*kg_mt*GWP_CH4","v":0},{"$f":"SUM(L169:Q169)","v":0},null,"1980 & earlier",{"$f":"C169*Factors!K178*g_kg*kg_mt*GWP_N2O","v":0},{"$f":"D169*Factors!L178*g_kg*kg_mt*GWP_N2O","v":0},{"$f":"E169*Factors!M178*g_kg*kg_mt*GWP_N2O","v":0},{"$f":"F169*Factors!N178*g_kg*kg_mt*GWP_N2O","v":0},{"$f":"G169*Factors!O178*g_kg*kg_mt*GWP_N2O","v":0},{"$f":"H169*Factors!P178*g_kg*kg_mt*GWP_N2O","v":0},{"$f":"SUM(U169:Z169)","v":0}]
[null,1981,{"$f":"SUMIFS('Mobile-Data'!$I$9:$I$1048576,'Mobile-Data'!$D$9:$D$1048576,$B170,'Mobile-Data'!$E$9:$E$1048576,'Mobile-Detail Calcs'!C$167,'Mobile-Data'!$G$9:$G$1048576,'Mobile-Detail Calcs'!C$168,'Mobile-Data'!$C$9:$C$1048576,'Mobile-Detail Calcs'!$C$162)","v":0},{"$f":"SUMIFS('Mobile-Data'!$I$9:$I$1048576,'Mobile-Data'!$D$9:$D$1048576,$B170,'Mobile-Data'!$E$9:$E$1048576,'Mobile-Detail Calcs'!D$167,'Mobile-Data'!$G$9:$G$1048576,'Mobile-Detail Calcs'!D$168,'Mobile-Data'!$C$9:$C$1048576,'Mobile-Detail Calcs'!$C$162)","v":0},{"$f":"SUMIFS('Mobile-Data'!$I$9:$I$1048576,'Mobile-Data'!$D$9:$D$1048576,$B170,'Mobile-Data'!$E$9:$E$1048576,'Mobile-Detail Calcs'!E$167,'Mobile-Data'!$G$9:$G$1048576,'Mobile-Detail Calcs'!E$168,'Mobile-Data'!$C$9:$C$1048576,'Mobile-Detail Calcs'!$C$162)","v":0},{"$f":"SUMIFS('Mobile-Data'!$I$9:$I$1048576,'Mobile-Data'!$D$9:$D$1048576,$B170,'Mobile-Data'!$E$9:$E$1048576,'Mobile-Detail Calcs'!F$167,'Mobile-Data'!$G$9:$G$1048576,'Mobile-Detail Calcs'!F$168,'Mobile-Data'!$C$9:$C$1048576,'Mobile-Detail Calcs'!$C$162)","v":0},{"$f":"SUMIFS('Mobile-Data'!$I$9:$I$1048576,'Mobile-Data'!$D$9:$D$1048576,$B170,'Mobile-Data'!$E$9:$E$1048576,'Mobile-Detail Calcs'!G$167,'Mobile-Data'!$G$9:$G$1048576,'Mobile-Detail Calcs'!G$168,'Mobile-Data'!$C$9:$C$1048576,'Mobile-Detail Calcs'!$C$162)","v":0},{"$f":"SUMIFS('Mobile-Data'!$I$9:$I$1048576,'Mobile-Data'!$D$9:$D$1048576,$B170,'Mobile-Data'!$E$9:$E$1048576,'Mobile-Detail Calcs'!H$167,'Mobile-Data'!$G$9:$G$1048576,'Mobile-Detail Calcs'!H$168,'Mobile-Data'!$C$9:$C$1048576,'Mobile-Detail Calcs'!$C$162)","v":0},{"$f":"SUM(C170:H170)","v":0},null,1981,{"$f":"C170*Factors!C179*g_kg*kg_mt*GWP_CH4","v":0},{"$f":"D170*Factors!D179*g_kg*kg_mt*GWP_CH4","v":0},{"$f":"E170*Factors!E179*g_kg*kg_mt*GWP_CH4","v":0},{"$f":"F170*Factors!F179*g_kg*kg_mt*GWP_CH4","v":0},{"$f":"G170*Factors!G179*g_kg*kg_mt*GWP_CH4","v":0},{"$f":"H170*Factors!H179*g_kg*kg_mt*GWP_CH4","v":0},{"$f":"SUM(L170:Q170)","v":0},null,1981,{"$f":"C170*Factors!K179*g_kg*kg_mt*GWP_N2O","v":0},{"$f":"D170*Factors!L179*g_kg*kg_mt*GWP_N2O","v":0},{"$f":"E170*Factors!M179*g_kg*kg_mt*GWP_N2O","v":0},{"$f":"F170*Factors!N179*g_kg*kg_mt*GWP_N2O","v":0},{"$f":"G170*Factors!O179*g_kg*kg_mt*GWP_N2O","v":0},{"$f":"H170*Factors!P179*g_kg*kg_mt*GWP_N2O","v":0},{"$f":"SUM(U170:Z170)","v":0}]
[null,1982,{"$f":"SUMIFS('Mobile-Data'!$I$9:$I$1048576,'Mobile-Data'!$D$9:$D$1048576,$B171,'Mobile-Data'!$E$9:$E$1048576,'Mobile-Detail Calcs'!C$167,'Mobile-Data'!$G$9:$G$1048576,'Mobile-Detail Calcs'!C$168,'Mobile-Data'!$C$9:$C$1048576,'Mobile-Detail Calcs'!$C$162)","v":0},{"$f":"SUMIFS('Mobile-Data'!$I$9:$I$1048576,'Mobile-Data'!$D$9:$D$1048576,$B171,'Mobile-Data'!$E$9:$E$1048576,'Mobile-Detail Calcs'!D$167,'Mobile-Data'!$G$9:$G$1048576,'Mobile-Detail Calcs'!D$168,'Mobile-Data'!$C$9:$C$1048576,'Mobile-Detail Calcs'!$C$162)","v":0},{"$f":"SUMIFS('Mobile-Data'!$I$9:$I$1048576,'Mobile-Data'!$D$9:$D$1048576,$B171,'Mobile-Data'!$E$9:$E$1048576,'Mobile-Detail Calcs'!E$167,'Mobile-Data'!$G$9:$G$1048576,'Mobile-Detail Calcs'!E$168,'Mobile-Data'!$C$9:$C$1048576,'Mobile-Detail Calcs'!$C$162)","v":0},{"$f":"SUMIFS('Mobile-Data'!$I$9:$I$1048576,'Mobile-Data'!$D$9:$D$1048576,$B171,'Mobile-Data'!$E$9:$E$1048576,'Mobile-Detail Calcs'!F$167,'Mobile-Data'!$G$9:$G$1048576,'Mobile-Detail Calcs'!F$168,'Mobile-Data'!$C$9:$C$1048576,'Mobile-Detail Calcs'!$C$162)","v":0},{"$f":"SUMIFS('Mobile-Data'!$I$9:$I$1048576,'Mobile-Data'!$D$9:$D$1048576,$B171,'Mobile-Data'!$E$9:$E$1048576,'Mobile-Detail Calcs'!G$167,'Mobile-Data'!$G$9:$G$1048576,'Mobile-Detail Calcs'!G$168,'Mobile-Data'!$C$9:$C$1048576,'Mobile-Detail Calcs'!$C$162)","v":0},{"$f":"SUMIFS('Mobile-Data'!$I$9:$I$1048576,'Mobile-Data'!$D$9:$D$1048576,$B171,'Mobile-Data'!$E$9:$E$1048576,'Mobile-Detail Calcs'!H$167,'Mobile-Data'!$G$9:$G$1048576,'Mobile-Detail Calcs'!H$168,'Mobile-Data'!$C$9:$C$1048576,'Mobile-Detail Calcs'!$C$162)","v":0},0,null,1982,{"$f":"C171*Factors!C180*g_kg*kg_mt*GWP_CH4","v":0},{"$f":"D171*Factors!D180*g_kg*kg_mt*GWP_CH4","v":0},{"$f":"E171*Factors!E180*g_kg*kg_mt*GWP_CH4","v":0},{"$f":"F171*Factors!F180*g_kg*kg_mt*GWP_CH4","v":0},{"$f":"G171*Factors!G180*g_kg*kg_mt*GWP_CH4","v":0},{"$f":"H171*Factors!H180*g_kg*kg_mt*GWP_CH4","v":0},0,null,1982,{"$f":"C171*Factors!K180*g_kg*kg_mt*GWP_N2O","v":0},{"$f":"D171*Factors!L180*g_kg*kg_mt*GWP_N2O","v":0},{"$f":"E171*Factors!M180*g_kg*kg_mt*GWP_N2O","v":0},{"$f":"F171*Factors!N180*g_kg*kg_mt*GWP_N2O","v":0},{"$f":"G171*Factors!O180*g_kg*kg_mt*GWP_N2O","v":0},{"$f":"H171*Factors!P180*g_kg*kg_mt*GWP_N2O","v":0},0]
[null,1983,{"$f":"SUMIFS('Mobile-Data'!$I$9:$I$1048576,'Mobile-Data'!$D$9:$D$1048576,$B172,'Mobile-Data'!$E$9:$E$1048576,'Mobile-Detail Calcs'!C$167,'Mobile-Data'!$G$9:$G$1048576,'Mobile-Detail Calcs'!C$168,'Mobile-Data'!$C$9:$C$1048576,'Mobile-Detail Calcs'!$C$162)","v":0},{"$f":"SUMIFS('Mobile-Data'!$I$9:$I$1048576,'Mobile-Data'!$D$9:$D$1048576,$B172,'Mobile-Data'!$E$9:$E$1048576,'Mobile-Detail Calcs'!D$167,'Mobile-Data'!$G$9:$G$1048576,'Mobile-Detail Calcs'!D$168,'Mobile-Data'!$C$9:$C$1048576,'Mobile-Detail Calcs'!$C$162)","v":0},{"$f":"SUMIFS('Mobile-Data'!$I$9:$I$1048576,'Mobile-Data'!$D$9:$D$1048576,$B172,'Mobile-Data'!$E$9:$E$1048576,'Mobile-Detail Calcs'!E$167,'Mobile-Data'!$G$9:$G$1048576,'Mobile-Detail Calcs'!E$168,'Mobile-Data'!$C$9:$C$1048576,'Mobile-Detail Calcs'!$C$162)","v":0},{"$f":"SUMIFS('Mobile-Data'!$I$9:$I$1048576,'Mobile-Data'!$D$9:$D$1048576,$B172,'Mobile-Data'!$E$9:$E$1048576,'Mobile-Detail Calcs'!F$167,'Mobile-Data'!$G$9:$G$1048576,'Mobile-Detail Calcs'!F$168,'Mobile-Data'!$C$9:$C$1048576,'Mobile-Detail Calcs'!$C$162)","v":0},{"$f":"SUMIFS('Mobile-Data'!$I$9:$I$1048576,'Mobile-Data'!$D$9:$D$1048576,$B172,'Mobile-Data'!$E$9:$E$1048576,'Mobile-Detail Calcs'!G$167,'Mobile-Data'!$G$9:$G$1048576,'Mobile-Detail Calcs'!G$168,'Mobile-Data'!$C$9:$C$1048576,'Mobile-Detail Calcs'!$C$162)","v":0},{"$f":"SUMIFS('Mobile-Data'!$I$9:$I$1048576,'Mobile-Data'!$D$9:$D$1048576,$B172,'Mobile-Data'!$E$9:$E$1048576,'Mobile-Detail Calcs'!H$167,'Mobile-Data'!$G$9:$G$1048576,'Mobile-Detail Calcs'!H$168,'Mobile-Data'!$C$9:$C$1048576,'Mobile-Detail Calcs'!$C$162)","v":0},0,null,1983,{"$f":"C172*Factors!C181*g_kg*kg_mt*GWP_CH4","v":0},{"$f":"D172*Factors!D181*g_kg*kg_mt*GWP_CH4","v":0},{"$f":"E172*Factors!E181*g_kg*kg_mt*GWP_CH4","v":0},{"$f":"F172*Factors!F181*g_kg*kg_mt*GWP_CH4","v":0},{"$f":"G172*Factors!G181*g_kg*kg_mt*GWP_CH4","v":0},{"$f":"H172*Factors!H181*g_kg*kg_mt*GWP_CH4","v":0},0,null,1983,{"$f":"C172*Factors!K181*g_kg*kg_mt*GWP_N2O","v":0},{"$f":"D172*Factors!L181*g_kg*kg_mt*GWP_N2O","v":0},{"$f":"E172*Factors!M181*g_kg*kg_mt*GWP_N2O","v":0},{"$f":"F172*Factors!N181*g_kg*kg_mt*GWP_N2O","v":0},{"$f":"G172*Factors!O181*g_kg*kg_mt*GWP_N2O","v":0},{"$f":"H172*Factors!P181*g_kg*kg_mt*GWP_N2O","v":0},0]
[null,1984,{"$f":"SUMIFS('Mobile-Data'!$I$9:$I$1048576,'Mobile-Data'!$D$9:$D$1048576,$B173,'Mobile-Data'!$E$9:$E$1048576,'Mobile-Detail Calcs'!C$167,'Mobile-Data'!$G$9:$G$1048576,'Mobile-Detail Calcs'!C$168,'Mobile-Data'!$C$9:$C$1048576,'Mobile-Detail Calcs'!$C$162)","v":0},{"$f":"SUMIFS('Mobile-Data'!$I$9:$I$1048576,'Mobile-Data'!$D$9:$D$1048576,$B173,'Mobile-Data'!$E$9:$E$1048576,'Mobile-Detail Calcs'!D$167,'Mobile-Data'!$G$9:$G$1048576,'Mobile-Detail Calcs'!D$168,'Mobile-Data'!$C$9:$C$1048576,'Mobile-Detail Calcs'!$C$162)","v":0},{"$f":"SUMIFS('Mobile-Data'!$I$9:$I$1048576,'Mobile-Data'!$D$9:$D$1048576,$B173,'Mobile-Data'!$E$9:$E$1048576,'Mobile-Detail Calcs'!E$167,'Mobile-Data'!$G$9:$G$1048576,'Mobile-Detail Calcs'!E$168,'Mobile-Data'!$C$9:$C$1048576,'Mobile-Detail Calcs'!$C$162)","v":0},{"$f":"SUMIFS('Mobile-Data'!$I$9:$I$1048576,'Mobile-Data'!$D$9:$D$1048576,$B173,'Mobile-Data'!$E$9:$E$1048576,'Mobile-Detail Calcs'!F$167,'Mobile-Data'!$G$9:$G$1048576,'Mobile-Detail Calcs'!F$168,'Mobile-Data'!$C$9:$C$1048576,'Mobile-Detail Calcs'!$C$162)","v":0},{"$f":"SUMIFS('Mobile-Data'!$I$9:$I$1048576,'Mobile-Data'!$D$9:$D$1048576,$B173,'Mobile-Data'!$E$9:$E$1048576,'Mobile-Detail Calcs'!G$167,'Mobile-Data'!$G$9:$G$1048576,'Mobile-Detail Calcs'!G$168,'Mobile-Data'!$C$9:$C$1048576,'Mobile-Detail Calcs'!$C$162)","v":0},{"$f":"SUMIFS('Mobile-Data'!$I$9:$I$1048576,'Mobile-Data'!$D$9:$D$1048576,$B173,'Mobile-Data'!$E$9:$E$1048576,'Mobile-Detail Calcs'!H$167,'Mobile-Data'!$G$9:$G$1048576,'Mobile-Detail Calcs'!H$168,'Mobile-Data'!$C$9:$C$1048576,'Mobile-Detail Calcs'!$C$162)","v":0},0,null,1984,{"$f":"C173*Factors!C182*g_kg*kg_mt*GWP_CH4","v":0},{"$f":"D173*Factors!D182*g_kg*kg_mt*GWP_CH4","v":0},{"$f":"E173*Factors!E182*g_kg*kg_mt*GWP_CH4","v":0},{"$f":"F173*Factors!F182*g_kg*kg_mt*GWP_CH4","v":0},{"$f":"G173*Factors!G182*g_kg*kg_mt*GWP_CH4","v":0},{"$f":"H173*Factors!H182*g_kg*kg_mt*GWP_CH4","v":0},0,null,1984,{"$f":"C173*Factors!K182*g_kg*kg_mt*GWP_N2O","v":0},{"$f":"D173*Factors!L182*g_kg*kg_mt*GWP_N2O","v":0},{"$f":"E173*Factors!M182*g_kg*kg_mt*GWP_N2O","v":0},{"$f":"F173*Factors!N182*g_kg*kg_mt*GWP_N2O","v":0},{"$f":"G173*Factors!O182*g_kg*kg_mt*GWP_N2O","v":0},{"$f":"H173*Factors!P182*g_kg*kg_mt*GWP_N2O","v":0},0]
[null,1985,{"$f":"SUMIFS('Mobile-Data'!$I$9:$I$1048576,'Mobile-Data'!$D$9:$D$1048576,$B174,'Mobile-Data'!$E$9:$E$1048576,'Mobile-Detail Calcs'!C$167,'Mobile-Data'!$G$9:$G$1048576,'Mobile-Detail Calcs'!C$168,'Mobile-Data'!$C$9:$C$1048576,'Mobile-Detail Calcs'!$C$162)","v":0},{"$f":"SUMIFS('Mobile-Data'!$I$9:$I$1048576,'Mobile-Data'!$D$9:$D$1048576,$B174,'Mobile-Data'!$E$9:$E$1048576,'Mobile-Detail Calcs'!D$167,'Mobile-Data'!$G$9:$G$1048576,'Mobile-Detail Calcs'!D$168,'Mobile-Data'!$C$9:$C$1048576,'Mobile-Detail Calcs'!$C$162)","v":0},{"$f":"SUMIFS('Mobile-Data'!$I$9:$I$1048576,'Mobile-Data'!$D$9:$D$1048576,$B174,'Mobile-Data'!$E$9:$E$1048576,'Mobile-Detail Calcs'!E$167,'Mobile-Data'!$G$9:$G$1048576,'Mobile-Detail Calcs'!E$168,'Mobile-Data'!$C$9:$C$1048576,'Mobile-Detail Calcs'!$C$162)","v":0},{"$f":"SUMIFS('Mobile-Data'!$I$9:$I$1048576,'Mobile-Data'!$D$9:$D$1048576,$B174,'Mobile-Data'!$E$9:$E$1048576,'Mobile-Detail Calcs'!F$167,'Mobile-Data'!$G$9:$G$1048576,'Mobile-Detail Calcs'!F$168,'Mobile-Data'!$C$9:$C$1048576,'Mobile-Detail Calcs'!$C$162)","v":0},{"$f":"SUMIFS('Mobile-Data'!$I$9:$I$1048576,'Mobile-Data'!$D$9:$D$1048576,$B174,'Mobile-Data'!$E$9:$E$1048576,'Mobile-Detail Calcs'!G$167,'Mobile-Data'!$G$9:$G$1048576,'Mobile-Detail Calcs'!G$168,'Mobile-Data'!$C$9:$C$1048576,'Mobile-Detail Calcs'!$C$162)","v":0},{"$f":"SUMIFS('Mobile-Data'!$I$9:$I$1048576,'Mobile-Data'!$D$9:$D$1048576,$B174,'Mobile-Data'!$E$9:$E$1048576,'Mobile-Detail Calcs'!H$167,'Mobile-Data'!$G$9:$G$1048576,'Mobile-Detail Calcs'!H$168,'Mobile-Data'!$C$9:$C$1048576,'Mobile-Detail Calcs'!$C$162)","v":0},0,null,1985,{"$f":"C174*Factors!C183*g_kg*kg_mt*GWP_CH4","v":0},{"$f":"D174*Factors!D183*g_kg*kg_mt*GWP_CH4","v":0},{"$f":"E174*Factors!E183*g_kg*kg_mt*GWP_CH4","v":0},{"$f":"F174*Factors!F183*g_kg*kg_mt*GWP_CH4","v":0},{"$f":"G174*Factors!G183*g_kg*kg_mt*GWP_CH4","v":0},{"$f":"H174*Factors!H183*g_kg*kg_mt*GWP_CH4","v":0},0,null,1985,{"$f":"C174*Factors!K183*g_kg*kg_mt*GWP_N2O","v":0},{"$f":"D174*Factors!L183*g_kg*kg_mt*GWP_N2O","v":0},{"$f":"E174*Factors!M183*g_kg*kg_mt*GWP_N2O","v":0},{"$f":"F174*Factors!N183*g_kg*kg_mt*GWP_N2O","v":0},{"$f":"G174*Factors!O183*g_kg*kg_mt*GWP_N2O","v":0},{"$f":"H174*Factors!P183*g_kg*kg_mt*GWP_N2O","v":0},0]
[null,1986,{"$f":"SUMIFS('Mobile-Data'!$I$9:$I$1048576,'Mobile-Data'!$D$9:$D$1048576,$B175,'Mobile-Data'!$E$9:$E$1048576,'Mobile-Detail Calcs'!C$167,'Mobile-Data'!$G$9:$G$1048576,'Mobile-Detail Calcs'!C$168,'Mobile-Data'!$C$9:$C$1048576,'Mobile-Detail Calcs'!$C$162)","v":0},{"$f":"SUMIFS('Mobile-Data'!$I$9:$I$1048576,'Mobile-Data'!$D$9:$D$1048576,$B175,'Mobile-Data'!$E$9:$E$1048576,'Mobile-Detail Calcs'!D$167,'Mobile-Data'!$G$9:$G$1048576,'Mobile-Detail Calcs'!D$168,'Mobile-Data'!$C$9:$C$1048576,'Mobile-Detail Calcs'!$C$162)","v":0},{"$f":"SUMIFS('Mobile-Data'!$I$9:$I$1048576,'Mobile-Data'!$D$9:$D$1048576,$B175,'Mobile-Data'!$E$9:$E$1048576,'Mobile-Detail Calcs'!E$167,'Mobile-Data'!$G$9:$G$1048576,'Mobile-Detail Calcs'!E$168,'Mobile-Data'!$C$9:$C$1048576,'Mobile-Detail Calcs'!$C$162)","v":0},{"$f":"SUMIFS('Mobile-Data'!$I$9:$I$1048576,'Mobile-Data'!$D$9:$D$1048576,$B175,'Mobile-Data'!$E$9:$E$1048576,'Mobile-Detail Calcs'!F$167,'Mobile-Data'!$G$9:$G$1048576,'Mobile-Detail Calcs'!F$168,'Mobile-Data'!$C$9:$C$1048576,'Mobile-Detail Calcs'!$C$162)","v":0},{"$f":"SUMIFS('Mobile-Data'!$I$9:$I$1048576,'Mobile-Data'!$D$9:$D$1048576,$B175,'Mobile-Data'!$E$9:$E$1048576,'Mobile-Detail Calcs'!G$167,'Mobile-Data'!$G$9:$G$1048576,'Mobile-Detail Calcs'!G$168,'Mobile-Data'!$C$9:$C$1048576,'Mobile-Detail Calcs'!$C$162)","v":0},{"$f":"SUMIFS('Mobile-Data'!$I$9:$I$1048576,'Mobile-Data'!$D$9:$D$1048576,$B175,'Mobile-Data'!$E$9:$E$1048576,'Mobile-Detail Calcs'!H$167,'Mobile-Data'!$G$9:$G$1048576,'Mobile-Detail Calcs'!H$168,'Mobile-Data'!$C$9:$C$1048576,'Mobile-Detail Calcs'!$C$162)","v":0},0,null,1986,{"$f":"C175*Factors!C184*g_kg*kg_mt*GWP_CH4","v":0},{"$f":"D175*Factors!D184*g_kg*kg_mt*GWP_CH4","v":0},{"$f":"E175*Factors!E184*g_kg*kg_mt*GWP_CH4","v":0},{"$f":"F175*Factors!F184*g_kg*kg_mt*GWP_CH4","v":0},{"$f":"G175*Factors!G184*g_kg*kg_mt*GWP_CH4","v":0},{"$f":"H175*Factors!H184*g_kg*kg_mt*GWP_CH4","v":0},0,null,1986,{"$f":"C175*Factors!K184*g_kg*kg_mt*GWP_N2O","v":0},{"$f":"D175*Factors!L184*g_kg*kg_mt*GWP_N2O","v":0},{"$f":"E175*Factors!M184*g_kg*kg_mt*GWP_N2O","v":0},{"$f":"F175*Factors!N184*g_kg*kg_mt*GWP_N2O","v":0},{"$f":"G175*Factors!O184*g_kg*kg_mt*GWP_N2O","v":0},{"$f":"H175*Factors!P184*g_kg*kg_mt*GWP_N2O","v":0},0]
[null,1987,{"$f":"SUMIFS('Mobile-Data'!$I$9:$I$1048576,'Mobile-Data'!$D$9:$D$1048576,$B176,'Mobile-Data'!$E$9:$E$1048576,'Mobile-Detail Calcs'!C$167,'Mobile-Data'!$G$9:$G$1048576,'Mobile-Detail Calcs'!C$168,'Mobile-Data'!$C$9:$C$1048576,'Mobile-Detail Calcs'!$C$162)","v":0},{"$f":"SUMIFS('Mobile-Data'!$I$9:$I$1048576,'Mobile-Data'!$D$9:$D$1048576,$B176,'Mobile-Data'!$E$9:$E$1048576,'Mobile-Detail Calcs'!D$167,'Mobile-Data'!$G$9:$G$1048576,'Mobile-Detail Calcs'!D$168,'Mobile-Data'!$C$9:$C$1048576,'Mobile-Detail Calcs'!$C$162)","v":0},{"$f":"SUMIFS('Mobile-Data'!$I$9:$I$1048576,'Mobile-Data'!$D$9:$D$1048576,$B176,'Mobile-Data'!$E$9:$E$1048576,'Mobile-Detail Calcs'!E$167,'Mobile-Data'!$G$9:$G$1048576,'Mobile-Detail Calcs'!E$168,'Mobile-Data'!$C$9:$C$1048576,'Mobile-Detail Calcs'!$C$162)","v":0},{"$f":"SUMIFS('Mobile-Data'!$I$9:$I$1048576,'Mobile-Data'!$D$9:$D$1048576,$B176,'Mobile-Data'!$E$9:$E$1048576,'Mobile-Detail Calcs'!F$167,'Mobile-Data'!$G$9:$G$1048576,'Mobile-Detail Calcs'!F$168,'Mobile-Data'!$C$9:$C$1048576,'Mobile-Detail Calcs'!$C$162)","v":0},{"$f":"SUMIFS('Mobile-Data'!$I$9:$I$1048576,'Mobile-Data'!$D$9:$D$1048576,$B176,'Mobile-Data'!$E$9:$E$1048576,'Mobile-Detail Calcs'!G$167,'Mobile-Data'!$G$9:$G$1048576,'Mobile-Detail Calcs'!G$168,'Mobile-Data'!$C$9:$C$1048576,'Mobile-Detail Calcs'!$C$162)","v":0},{"$f":"SUMIFS('Mobile-Data'!$I$9:$I$1048576,'Mobile-Data'!$D$9:$D$1048576,$B176,'Mobile-Data'!$E$9:$E$1048576,'Mobile-Detail Calcs'!H$167,'Mobile-Data'!$G$9:$G$1048576,'Mobile-Detail Calcs'!H$168,'Mobile-Data'!$C$9:$C$1048576,'Mobile-Detail Calcs'!$C$162)","v":0},0,null,1987,{"$f":"C176*Factors!C185*g_kg*kg_mt*GWP_CH4","v":0},{"$f":"D176*Factors!D185*g_kg*kg_mt*GWP_CH4","v":0},{"$f":"E176*Factors!E185*g_kg*kg_mt*GWP_CH4","v":0},{"$f":"F176*Factors!F185*g_kg*kg_mt*GWP_CH4","v":0},{"$f":"G176*Factors!G185*g_kg*kg_mt*GWP_CH4","v":0},{"$f":"H176*Factors!H185*g_kg*kg_mt*GWP_CH4","v":0},0,null,1987,{"$f":"C176*Factors!K185*g_kg*kg_mt*GWP_N2O","v":0},{"$f":"D176*Factors!L185*g_kg*kg_mt*GWP_N2O","v":0},{"$f":"E176*Factors!M185*g_kg*kg_mt*GWP_N2O","v":0},{"$f":"F176*Factors!N185*g_kg*kg_mt*GWP_N2O","v":0},{"$f":"G176*Factors!O185*g_kg*kg_mt*GWP_N2O","v":0},{"$f":"H176*Factors!P185*g_kg*kg_mt*GWP_N2O","v":0},0]
[null,1988,{"$f":"SUMIFS('Mobile-Data'!$I$9:$I$1048576,'Mobile-Data'!$D$9:$D$1048576,$B177,'Mobile-Data'!$E$9:$E$1048576,'Mobile-Detail Calcs'!C$167,'Mobile-Data'!$G$9:$G$1048576,'Mobile-Detail Calcs'!C$168,'Mobile-Data'!$C$9:$C$1048576,'Mobile-Detail Calcs'!$C$162)","v":0},{"$f":"SUMIFS('Mobile-Data'!$I$9:$I$1048576,'Mobile-Data'!$D$9:$D$1048576,$B177,'Mobile-Data'!$E$9:$E$1048576,'Mobile-Detail Calcs'!D$167,'Mobile-Data'!$G$9:$G$1048576,'Mobile-Detail Calcs'!D$168,'Mobile-Data'!$C$9:$C$1048576,'Mobile-Detail Calcs'!$C$162)","v":0},{"$f":"SUMIFS('Mobile-Data'!$I$9:$I$1048576,'Mobile-Data'!$D$9:$D$1048576,$B177,'Mobile-Data'!$E$9:$E$1048576,'Mobile-Detail Calcs'!E$167,'Mobile-Data'!$G$9:$G$1048576,'Mobile-Detail Calcs'!E$168,'Mobile-Data'!$C$9:$C$1048576,'Mobile-Detail Calcs'!$C$162)","v":0},{"$f":"SUMIFS('Mobile-Data'!$I$9:$I$1048576,'Mobile-Data'!$D$9:$D$1048576,$B177,'Mobile-Data'!$E$9:$E$1048576,'Mobile-Detail Calcs'!F$167,'Mobile-Data'!$G$9:$G$1048576,'Mobile-Detail Calcs'!F$168,'Mobile-Data'!$C$9:$C$1048576,'Mobile-Detail Calcs'!$C$162)","v":0},{"$f":"SUMIFS('Mobile-Data'!$I$9:$I$1048576,'Mobile-Data'!$D$9:$D$1048576,$B177,'Mobile-Data'!$E$9:$E$1048576,'Mobile-Detail Calcs'!G$167,'Mobile-Data'!$G$9:$G$1048576,'Mobile-Detail Calcs'!G$168,'Mobile-Data'!$C$9:$C$1048576,'Mobile-Detail Calcs'!$C$162)","v":0},{"$f":"SUMIFS('Mobile-Data'!$I$9:$I$1048576,'Mobile-Data'!$D$9:$D$1048576,$B177,'Mobile-Data'!$E$9:$E$1048576,'Mobile-Detail Calcs'!H$167,'Mobile-Data'!$G$9:$G$1048576,'Mobile-Detail Calcs'!H$168,'Mobile-Data'!$C$9:$C$1048576,'Mobile-Detail Calcs'!$C$162)","v":0},0,null,1988,{"$f":"C177*Factors!C186*g_kg*kg_mt*GWP_CH4","v":0},{"$f":"D177*Factors!D186*g_kg*kg_mt*GWP_CH4","v":0},{"$f":"E177*Factors!E186*g_kg*kg_mt*GWP_CH4","v":0},{"$f":"F177*Factors!F186*g_kg*kg_mt*GWP_CH4","v":0},{"$f":"G177*Factors!G186*g_kg*kg_mt*GWP_CH4","v":0},{"$f":"H177*Factors!H186*g_kg*kg_mt*GWP_CH4","v":0},0,null,1988,{"$f":"C177*Factors!K186*g_kg*kg_mt*GWP_N2O","v":0},{"$f":"D177*Factors!L186*g_kg*kg_mt*GWP_N2O","v":0},{"$f":"E177*Factors!M186*g_kg*kg_mt*GWP_N2O","v":0},{"$f":"F177*Factors!N186*g_kg*kg_mt*GWP_N2O","v":0},{"$f":"G177*Factors!O186*g_kg*kg_mt*GWP_N2O","v":0},{"$f":"H177*Factors!P186*g_kg*kg_mt*GWP_N2O","v":0},0]
[null,1989,{"$f":"SUMIFS('Mobile-Data'!$I$9:$I$1048576,'Mobile-Data'!$D$9:$D$1048576,$B178,'Mobile-Data'!$E$9:$E$1048576,'Mobile-Detail Calcs'!C$167,'Mobile-Data'!$G$9:$G$1048576,'Mobile-Detail Calcs'!C$168,'Mobile-Data'!$C$9:$C$1048576,'Mobile-Detail Calcs'!$C$162)","v":0},{"$f":"SUMIFS('Mobile-Data'!$I$9:$I$1048576,'Mobile-Data'!$D$9:$D$1048576,$B178,'Mobile-Data'!$E$9:$E$1048576,'Mobile-Detail Calcs'!D$167,'Mobile-Data'!$G$9:$G$1048576,'Mobile-Detail Calcs'!D$168,'Mobile-Data'!$C$9:$C$1048576,'Mobile-Detail Calcs'!$C$162)","v":0},{"$f":"SUMIFS('Mobile-Data'!$I$9:$I$1048576,'Mobile-Data'!$D$9:$D$1048576,$B178,'Mobile-Data'!$E$9:$E$1048576,'Mobile-Detail Calcs'!E$167,'Mobile-Data'!$G$9:$G$1048576,'Mobile-Detail Calcs'!E$168,'Mobile-Data'!$C$9:$C$1048576,'Mobile-Detail Calcs'!$C$162)","v":0},{"$f":"SUMIFS('Mobile-Data'!$I$9:$I$1048576,'Mobile-Data'!$D$9:$D$1048576,$B178,'Mobile-Data'!$E$9:$E$1048576,'Mobile-Detail Calcs'!F$167,'Mobile-Data'!$G$9:$G$1048576,'Mobile-Detail Calcs'!F$168,'Mobile-Data'!$C$9:$C$1048576,'Mobile-Detail Calcs'!$C$162)","v":0},{"$f":"SUMIFS('Mobile-Data'!$I$9:$I$1048576,'Mobile-Data'!$D$9:$D$1048576,$B178,'Mobile-Data'!$E$9:$E$1048576,'Mobile-Detail Calcs'!G$167,'Mobile-Data'!$G$9:$G$1048576,'Mobile-Detail Calcs'!G$168,'Mobile-Data'!$C$9:$C$1048576,'Mobile-Detail Calcs'!$C$162)","v":0},{"$f":"SUMIFS('Mobile-Data'!$I$9:$I$1048576,'Mobile-Data'!$D$9:$D$1048576,$B178,'Mobile-Data'!$E$9:$E$1048576,'Mobile-Detail Calcs'!H$167,'Mobile-Data'!$G$9:$G$1048576,'Mobile-Detail Calcs'!H$168,'Mobile-Data'!$C$9:$C$1048576,'Mobile-Detail Calcs'!$C$162)","v":0},0,null,1989,{"$f":"C178*Factors!C187*g_kg*kg_mt*GWP_CH4","v":0},{"$f":"D178*Factors!D187*g_kg*kg_mt*GWP_CH4","v":0},{"$f":"E178*Factors!E187*g_kg*kg_mt*GWP_CH4","v":0},{"$f":"F178*Factors!F187*g_kg*kg_mt*GWP_CH4","v":0},{"$f":"G178*Factors!G187*g_kg*kg_mt*GWP_CH4","v":0},{"$f":"H178*Factors!H187*g_kg*kg_mt*GWP_CH4","v":0},0,null,1989,{"$f":"C178*Factors!K187*g_kg*kg_mt*GWP_N2O","v":0},{"$f":"D178*Factors!L187*g_kg*kg_mt*GWP_N2O","v":0},{"$f":"E178*Factors!M187*g_kg*kg_mt*GWP_N2O","v":0},{"$f":"F178*Factors!N187*g_kg*kg_mt*GWP_N2O","v":0},{"$f":"G178*Factors!O187*g_kg*kg_mt*GWP_N2O","v":0},{"$f":"H178*Factors!P187*g_kg*kg_mt*GWP_N2O","v":0},0]
[null,1990,{"$f":"SUMIFS('Mobile-Data'!$I$9:$I$1048576,'Mobile-Data'!$D$9:$D$1048576,$B179,'Mobile-Data'!$E$9:$E$1048576,'Mobile-Detail Calcs'!C$167,'Mobile-Data'!$G$9:$G$1048576,'Mobile-Detail Calcs'!C$168,'Mobile-Data'!$C$9:$C$1048576,'Mobile-Detail Calcs'!$C$162)","v":0},{"$f":"SUMIFS('Mobile-Data'!$I$9:$I$1048576,'Mobile-Data'!$D$9:$D$1048576,$B179,'Mobile-Data'!$E$9:$E$1048576,'Mobile-Detail Calcs'!D$167,'Mobile-Data'!$G$9:$G$1048576,'Mobile-Detail Calcs'!D$168,'Mobile-Data'!$C$9:$C$1048576,'Mobile-Detail Calcs'!$C$162)","v":0},{"$f":"SUMIFS('Mobile-Data'!$I$9:$I$1048576,'Mobile-Data'!$D$9:$D$1048576,$B179,'Mobile-Data'!$E$9:$E$1048576,'Mobile-Detail Calcs'!E$167,'Mobile-Data'!$G$9:$G$1048576,'Mobile-Detail Calcs'!E$168,'Mobile-Data'!$C$9:$C$1048576,'Mobile-Detail Calcs'!$C$162)","v":0},{"$f":"SUMIFS('Mobile-Data'!$I$9:$I$1048576,'Mobile-Data'!$D$9:$D$1048576,$B179,'Mobile-Data'!$E$9:$E$1048576,'Mobile-Detail Calcs'!F$167,'Mobile-Data'!$G$9:$G$1048576,'Mobile-Detail Calcs'!F$168,'Mobile-Data'!$C$9:$C$1048576,'Mobile-Detail Calcs'!$C$162)","v":0},{"$f":"SUMIFS('Mobile-Data'!$I$9:$I$1048576,'Mobile-Data'!$D$9:$D$1048576,$B179,'Mobile-Data'!$E$9:$E$1048576,'Mobile-Detail Calcs'!G$167,'Mobile-Data'!$G$9:$G$1048576,'Mobile-Detail Calcs'!G$168,'Mobile-Data'!$C$9:$C$1048576,'Mobile-Detail Calcs'!$C$162)","v":0},{"$f":"SUMIFS('Mobile-Data'!$I$9:$I$1048576,'Mobile-Data'!$D$9:$D$1048576,$B179,'Mobile-Data'!$E$9:$E$1048576,'Mobile-Detail Calcs'!H$167,'Mobile-Data'!$G$9:$G$1048576,'Mobile-Detail Calcs'!H$168,'Mobile-Data'!$C$9:$C$1048576,'Mobile-Detail Calcs'!$C$162)","v":0},0,null,1990,{"$f":"C179*Factors!C188*g_kg*kg_mt*GWP_CH4","v":0},{"$f":"D179*Factors!D188*g_kg*kg_mt*GWP_CH4","v":0},{"$f":"E179*Factors!E188*g_kg*kg_mt*GWP_CH4","v":0},{"$f":"F179*Factors!F188*g_kg*kg_mt*GWP_CH4","v":0},{"$f":"G179*Factors!G188*g_kg*kg_mt*GWP_CH4","v":0},{"$f":"H179*Factors!H188*g_kg*kg_mt*GWP_CH4","v":0},0,null,1990,{"$f":"C179*Factors!K188*g_kg*kg_mt*GWP_N2O","v":0},{"$f":"D179*Factors!L188*g_kg*kg_mt*GWP_N2O","v":0},{"$f":"E179*Factors!M188*g_kg*kg_mt*GWP_N2O","v":0},{"$f":"F179*Factors!N188*g_kg*kg_mt*GWP_N2O","v":0},{"$f":"G179*Factors!O188*g_kg*kg_mt*GWP_N2O","v":0},{"$f":"H179*Factors!P188*g_kg*kg_mt*GWP_N2O","v":0},0]
[null,1991,{"$f":"SUMIFS('Mobile-Data'!$I$9:$I$1048576,'Mobile-Data'!$D$9:$D$1048576,$B180,'Mobile-Data'!$E$9:$E$1048576,'Mobile-Detail Calcs'!C$167,'Mobile-Data'!$G$9:$G$1048576,'Mobile-Detail Calcs'!C$168,'Mobile-Data'!$C$9:$C$1048576,'Mobile-Detail Calcs'!$C$162)","v":0},{"$f":"SUMIFS('Mobile-Data'!$I$9:$I$1048576,'Mobile-Data'!$D$9:$D$1048576,$B180,'Mobile-Data'!$E$9:$E$1048576,'Mobile-Detail Calcs'!D$167,'Mobile-Data'!$G$9:$G$1048576,'Mobile-Detail Calcs'!D$168,'Mobile-Data'!$C$9:$C$1048576,'Mobile-Detail Calcs'!$C$162)","v":0},{"$f":"SUMIFS('Mobile-Data'!$I$9:$I$1048576,'Mobile-Data'!$D$9:$D$1048576,$B180,'Mobile-Data'!$E$9:$E$1048576,'Mobile-Detail Calcs'!E$167,'Mobile-Data'!$G$9:$G$1048576,'Mobile-Detail Calcs'!E$168,'Mobile-Data'!$C$9:$C$1048576,'Mobile-Detail Calcs'!$C$162)","v":0},{"$f":"SUMIFS('Mobile-Data'!$I$9:$I$1048576,'Mobile-Data'!$D$9:$D$1048576,$B180,'Mobile-Data'!$E$9:$E$1048576,'Mobile-Detail Calcs'!F$167,'Mobile-Data'!$G$9:$G$1048576,'Mobile-Detail Calcs'!F$168,'Mobile-Data'!$C$9:$C$1048576,'Mobile-Detail Calcs'!$C$162)","v":0},{"$f":"SUMIFS('Mobile-Data'!$I$9:$I$1048576,'Mobile-Data'!$D$9:$D$1048576,$B180,'Mobile-Data'!$E$9:$E$1048576,'Mobile-Detail Calcs'!G$167,'Mobile-Data'!$G$9:$G$1048576,'Mobile-Detail Calcs'!G$168,'Mobile-Data'!$C$9:$C$1048576,'Mobile-Detail Calcs'!$C$162)","v":0},{"$f":"SUMIFS('Mobile-Data'!$I$9:$I$1048576,'Mobile-Data'!$D$9:$D$1048576,$B180,'Mobile-Data'!$E$9:$E$1048576,'Mobile-Detail Calcs'!H$167,'Mobile-Data'!$G$9:$G$1048576,'Mobile-Detail Calcs'!H$168,'Mobile-Data'!$C$9:$C$1048576,'Mobile-Detail Calcs'!$C$162)","v":0},0,null,1991,{"$f":"C180*Factors!C189*g_kg*kg_mt*GWP_CH4","v":0},{"$f":"D180*Factors!D189*g_kg*kg_mt*GWP_CH4","v":0},{"$f":"E180*Factors!E189*g_kg*kg_mt*GWP_CH4","v":0},{"$f":"F180*Factors!F189*g_kg*kg_mt*GWP_CH4","v":0},{"$f":"G180*Factors!G189*g_kg*kg_mt*GWP_CH4","v":0},{"$f":"H180*Factors!H189*g_kg*kg_mt*GWP_CH4","v":0},0,null,1991,{"$f":"C180*Factors!K189*g_kg*kg_mt*GWP_N2O","v":0},{"$f":"D180*Factors!L189*g_kg*kg_mt*GWP_N2O","v":0},{"$f":"E180*Factors!M189*g_kg*kg_mt*GWP_N2O","v":0},{"$f":"F180*Factors!N189*g_kg*kg_mt*GWP_N2O","v":0},{"$f":"G180*Factors!O189*g_kg*kg_mt*GWP_N2O","v":0},{"$f":"H180*Factors!P189*g_kg*kg_mt*GWP_N2O","v":0},0]
[null,1992,{"$f":"SUMIFS('Mobile-Data'!$I$9:$I$1048576,'Mobile-Data'!$D$9:$D$1048576,$B181,'Mobile-Data'!$E$9:$E$1048576,'Mobile-Detail Calcs'!C$167,'Mobile-Data'!$G$9:$G$1048576,'Mobile-Detail Calcs'!C$168,'Mobile-Data'!$C$9:$C$1048576,'Mobile-Detail Calcs'!$C$162)","v":0},{"$f":"SUMIFS('Mobile-Data'!$I$9:$I$1048576,'Mobile-Data'!$D$9:$D$1048576,$B181,'Mobile-Data'!$E$9:$E$1048576,'Mobile-Detail Calcs'!D$167,'Mobile-Data'!$G$9:$G$1048576,'Mobile-Detail Calcs'!D$168,'Mobile-Data'!$C$9:$C$1048576,'Mobile-Detail Calcs'!$C$162)","v":0},{"$f":"SUMIFS('Mobile-Data'!$I$9:$I$1048576,'Mobile-Data'!$D$9:$D$1048576,$B181,'Mobile-Data'!$E$9:$E$1048576,'Mobile-Detail Calcs'!E$167,'Mobile-Data'!$G$9:$G$1048576,'Mobile-Detail Calcs'!E$168,'Mobile-Data'!$C$9:$C$1048576,'Mobile-Detail Calcs'!$C$162)","v":0},{"$f":"SUMIFS('Mobile-Data'!$I$9:$I$1048576,'Mobile-Data'!$D$9:$D$1048576,$B181,'Mobile-Data'!$E$9:$E$1048576,'Mobile-Detail Calcs'!F$167,'Mobile-Data'!$G$9:$G$1048576,'Mobile-Detail Calcs'!F$168,'Mobile-Data'!$C$9:$C$1048576,'Mobile-Detail Calcs'!$C$162)","v":0},{"$f":"SUMIFS('Mobile-Data'!$I$9:$I$1048576,'Mobile-Data'!$D$9:$D$1048576,$B181,'Mobile-Data'!$E$9:$E$1048576,'Mobile-Detail Calcs'!G$167,'Mobile-Data'!$G$9:$G$1048576,'Mobile-Detail Calcs'!G$168,'Mobile-Data'!$C$9:$C$1048576,'Mobile-Detail Calcs'!$C$162)","v":0},{"$f":"SUMIFS('Mobile-Data'!$I$9:$I$1048576,'Mobile-Data'!$D$9:$D$1048576,$B181,'Mobile-Data'!$E$9:$E$1048576,'Mobile-Detail Calcs'!H$167,'Mobile-Data'!$G$9:$G$1048576,'Mobile-Detail Calcs'!H$168,'Mobile-Data'!$C$9:$C$1048576,'Mobile-Detail Calcs'!$C$162)","v":0},0,null,1992,{"$f":"C181*Factors!C190*g_kg*kg_mt*GWP_CH4","v":0},{"$f":"D181*Factors!D190*g_kg*kg_mt*GWP_CH4","v":0},{"$f":"E181*Factors!E190*g_kg*kg_mt*GWP_CH4","v":0},{"$f":"F181*Factors!F190*g_kg*kg_mt*GWP_CH4","v":0},{"$f":"G181*Factors!G190*g_kg*kg_mt*GWP_CH4","v":0},{"$f":"H181*Factors!H190*g_kg*kg_mt*GWP_CH4","v":0},0,null,1992,{"$f":"C181*Factors!K190*g_kg*kg_mt*GWP_N2O","v":0},{"$f":"D181*Factors!L190*g_kg*kg_mt*GWP_N2O","v":0},{"$f":"E181*Factors!M190*g_kg*kg_mt*GWP_N2O","v":0},{"$f":"F181*Factors!N190*g_kg*kg_mt*GWP_N2O","v":0},{"$f":"G181*Factors!O190*g_kg*kg_mt*GWP_N2O","v":0},{"$f":"H181*Factors!P190*g_kg*kg_mt*GWP_N2O","v":0},0]
[null,1993,{"$f":"SUMIFS('Mobile-Data'!$I$9:$I$1048576,'Mobile-Data'!$D$9:$D$1048576,$B182,'Mobile-Data'!$E$9:$E$1048576,'Mobile-Detail Calcs'!C$167,'Mobile-Data'!$G$9:$G$1048576,'Mobile-Detail Calcs'!C$168,'Mobile-Data'!$C$9:$C$1048576,'Mobile-Detail Calcs'!$C$162)","v":0},{"$f":"SUMIFS('Mobile-Data'!$I$9:$I$1048576,'Mobile-Data'!$D$9:$D$1048576,$B182,'Mobile-Data'!$E$9:$E$1048576,'Mobile-Detail Calcs'!D$167,'Mobile-Data'!$G$9:$G$1048576,'Mobile-Detail Calcs'!D$168,'Mobile-Data'!$C$9:$C$1048576,'Mobile-Detail Calcs'!$C$162)","v":0},{"$f":"SUMIFS('Mobile-Data'!$I$9:$I$1048576,'Mobile-Data'!$D$9:$D$1048576,$B182,'Mobile-Data'!$E$9:$E$1048576,'Mobile-Detail Calcs'!E$167,'Mobile-Data'!$G$9:$G$1048576,'Mobile-Detail Calcs'!E$168,'Mobile-Data'!$C$9:$C$1048576,'Mobile-Detail Calcs'!$C$162)","v":0},{"$f":"SUMIFS('Mobile-Data'!$I$9:$I$1048576,'Mobile-Data'!$D$9:$D$1048576,$B182,'Mobile-Data'!$E$9:$E$1048576,'Mobile-Detail Calcs'!F$167,'Mobile-Data'!$G$9:$G$1048576,'Mobile-Detail Calcs'!F$168,'Mobile-Data'!$C$9:$C$1048576,'Mobile-Detail Calcs'!$C$162)","v":0},{"$f":"SUMIFS('Mobile-Data'!$I$9:$I$1048576,'Mobile-Data'!$D$9:$D$1048576,$B182,'Mobile-Data'!$E$9:$E$1048576,'Mobile-Detail Calcs'!G$167,'Mobile-Data'!$G$9:$G$1048576,'Mobile-Detail Calcs'!G$168,'Mobile-Data'!$C$9:$C$1048576,'Mobile-Detail Calcs'!$C$162)","v":0},{"$f":"SUMIFS('Mobile-Data'!$I$9:$I$1048576,'Mobile-Data'!$D$9:$D$1048576,$B182,'Mobile-Data'!$E$9:$E$1048576,'Mobile-Detail Calcs'!H$167,'Mobile-Data'!$G$9:$G$1048576,'Mobile-Detail Calcs'!H$168,'Mobile-Data'!$C$9:$C$1048576,'Mobile-Detail Calcs'!$C$162)","v":0},0,null,1993,{"$f":"C182*Factors!C191*g_kg*kg_mt*GWP_CH4","v":0},{"$f":"D182*Factors!D191*g_kg*kg_mt*GWP_CH4","v":0},{"$f":"E182*Factors!E191*g_kg*kg_mt*GWP_CH4","v":0},{"$f":"F182*Factors!F191*g_kg*kg_mt*GWP_CH4","v":0},{"$f":"G182*Factors!G191*g_kg*kg_mt*GWP_CH4","v":0},{"$f":"H182*Factors!H191*g_kg*kg_mt*GWP_CH4","v":0},0,null,1993,{"$f":"C182*Factors!K191*g_kg*kg_mt*GWP_N2O","v":0},{"$f":"D182*Factors!L191*g_kg*kg_mt*GWP_N2O","v":0},{"$f":"E182*Factors!M191*g_kg*kg_mt*GWP_N2O","v":0},{"$f":"F182*Factors!N191*g_kg*kg_mt*GWP_N2O","v":0},{"$f":"G182*Factors!O191*g_kg*kg_mt*GWP_N2O","v":0},{"$f":"H182*Factors!P191*g_kg*kg_mt*GWP_N2O","v":0},0]
[null,1994,{"$f":"SUMIFS('Mobile-Data'!$I$9:$I$1048576,'Mobile-Data'!$D$9:$D$1048576,$B183,'Mobile-Data'!$E$9:$E$1048576,'Mobile-Detail Calcs'!C$167,'Mobile-Data'!$G$9:$G$1048576,'Mobile-Detail Calcs'!C$168,'Mobile-Data'!$C$9:$C$1048576,'Mobile-Detail Calcs'!$C$162)","v":0},{"$f":"SUMIFS('Mobile-Data'!$I$9:$I$1048576,'Mobile-Data'!$D$9:$D$1048576,$B183,'Mobile-Data'!$E$9:$E$1048576,'Mobile-Detail Calcs'!D$167,'Mobile-Data'!$G$9:$G$1048576,'Mobile-Detail Calcs'!D$168,'Mobile-Data'!$C$9:$C$1048576,'Mobile-Detail Calcs'!$C$162)","v":0},{"$f":"SUMIFS('Mobile-Data'!$I$9:$I$1048576,'Mobile-Data'!$D$9:$D$1048576,$B183,'Mobile-Data'!$E$9:$E$1048576,'Mobile-Detail Calcs'!E$167,'Mobile-Data'!$G$9:$G$1048576,'Mobile-Detail Calcs'!E$168,'Mobile-Data'!$C$9:$C$1048576,'Mobile-Detail Calcs'!$C$162)","v":0},{"$f":"SUMIFS('Mobile-Data'!$I$9:$I$1048576,'Mobile-Data'!$D$9:$D$1048576,$B183,'Mobile-Data'!$E$9:$E$1048576,'Mobile-Detail Calcs'!F$167,'Mobile-Data'!$G$9:$G$1048576,'Mobile-Detail Calcs'!F$168,'Mobile-Data'!$C$9:$C$1048576,'Mobile-Detail Calcs'!$C$162)","v":0},{"$f":"SUMIFS('Mobile-Data'!$I$9:$I$1048576,'Mobile-Data'!$D$9:$D$1048576,$B183,'Mobile-Data'!$E$9:$E$1048576,'Mobile-Detail Calcs'!G$167,'Mobile-Data'!$G$9:$G$1048576,'Mobile-Detail Calcs'!G$168,'Mobile-Data'!$C$9:$C$1048576,'Mobile-Detail Calcs'!$C$162)","v":0},{"$f":"SUMIFS('Mobile-Data'!$I$9:$I$1048576,'Mobile-Data'!$D$9:$D$1048576,$B183,'Mobile-Data'!$E$9:$E$1048576,'Mobile-Detail Calcs'!H$167,'Mobile-Data'!$G$9:$G$1048576,'Mobile-Detail Calcs'!H$168,'Mobile-Data'!$C$9:$C$1048576,'Mobile-Detail Calcs'!$C$162)","v":0},0,null,1994,{"$f":"C183*Factors!C192*g_kg*kg_mt*GWP_CH4","v":0},{"$f":"D183*Factors!D192*g_kg*kg_mt*GWP_CH4","v":0},{"$f":"E183*Factors!E192*g_kg*kg_mt*GWP_CH4","v":0},{"$f":"F183*Factors!F192*g_kg*kg_mt*GWP_CH4","v":0},{"$f":"G183*Factors!G192*g_kg*kg_mt*GWP_CH4","v":0},{"$f":"H183*Factors!H192*g_kg*kg_mt*GWP_CH4","v":0},0,null,1994,{"$f":"C183*Factors!K192*g_kg*kg_mt*GWP_N2O","v":0},{"$f":"D183*Factors!L192*g_kg*kg_mt*GWP_N2O","v":0},{"$f":"E183*Factors!M192*g_kg*kg_mt*GWP_N2O","v":0},{"$f":"F183*Factors!N192*g_kg*kg_mt*GWP_N2O","v":0},{"$f":"G183*Factors!O192*g_kg*kg_mt*GWP_N2O","v":0},{"$f":"H183*Factors!P192*g_kg*kg_mt*GWP_N2O","v":0},0]
[null,1995,{"$f":"SUMIFS('Mobile-Data'!$I$9:$I$1048576,'Mobile-Data'!$D$9:$D$1048576,$B184,'Mobile-Data'!$E$9:$E$1048576,'Mobile-Detail Calcs'!C$167,'Mobile-Data'!$G$9:$G$1048576,'Mobile-Detail Calcs'!C$168,'Mobile-Data'!$C$9:$C$1048576,'Mobile-Detail Calcs'!$C$162)","v":0},{"$f":"SUMIFS('Mobile-Data'!$I$9:$I$1048576,'Mobile-Data'!$D$9:$D$1048576,$B184,'Mobile-Data'!$E$9:$E$1048576,'Mobile-Detail Calcs'!D$167,'Mobile-Data'!$G$9:$G$1048576,'Mobile-Detail Calcs'!D$168,'Mobile-Data'!$C$9:$C$1048576,'Mobile-Detail Calcs'!$C$162)","v":0},{"$f":"SUMIFS('Mobile-Data'!$I$9:$I$1048576,'Mobile-Data'!$D$9:$D$1048576,$B184,'Mobile-Data'!$E$9:$E$1048576,'Mobile-Detail Calcs'!E$167,'Mobile-Data'!$G$9:$G$1048576,'Mobile-Detail Calcs'!E$168,'Mobile-Data'!$C$9:$C$1048576,'Mobile-Detail Calcs'!$C$162)","v":0},{"$f":"SUMIFS('Mobile-Data'!$I$9:$I$1048576,'Mobile-Data'!$D$9:$D$1048576,$B184,'Mobile-Data'!$E$9:$E$1048576,'Mobile-Detail Calcs'!F$167,'Mobile-Data'!$G$9:$G$1048576,'Mobile-Detail Calcs'!F$168,'Mobile-Data'!$C$9:$C$1048576,'Mobile-Detail Calcs'!$C$162)","v":0},{"$f":"SUMIFS('Mobile-Data'!$I$9:$I$1048576,'Mobile-Data'!$D$9:$D$1048576,$B184,'Mobile-Data'!$E$9:$E$1048576,'Mobile-Detail Calcs'!G$167,'Mobile-Data'!$G$9:$G$1048576,'Mobile-Detail Calcs'!G$168,'Mobile-Data'!$C$9:$C$1048576,'Mobile-Detail Calcs'!$C$162)","v":0},{"$f":"SUMIFS('Mobile-Data'!$I$9:$I$1048576,'Mobile-Data'!$D$9:$D$1048576,$B184,'Mobile-Data'!$E$9:$E$1048576,'Mobile-Detail Calcs'!H$167,'Mobile-Data'!$G$9:$G$1048576,'Mobile-Detail Calcs'!H$168,'Mobile-Data'!$C$9:$C$1048576,'Mobile-Detail Calcs'!$C$162)","v":0},0,null,1995,{"$f":"C184*Factors!C193*g_kg*kg_mt*GWP_CH4","v":0},{"$f":"D184*Factors!D193*g_kg*kg_mt*GWP_CH4","v":0},{"$f":"E184*Factors!E193*g_kg*kg_mt*GWP_CH4","v":0},{"$f":"F184*Factors!F193*g_kg*kg_mt*GWP_CH4","v":0},{"$f":"G184*Factors!G193*g_kg*kg_mt*GWP_CH4","v":0},{"$f":"H184*Factors!H193*g_kg*kg_mt*GWP_CH4","v":0},0,null,1995,{"$f":"C184*Factors!K193*g_kg*kg_mt*GWP_N2O","v":0},{"$f":"D184*Factors!L193*g_kg*kg_mt*GWP_N2O","v":0},{"$f":"E184*Factors!M193*g_kg*kg_mt*GWP_N2O","v":0},{"$f":"F184*Factors!N193*g_kg*kg_mt*GWP_N2O","v":0},{"$f":"G184*Factors!O193*g_kg*kg_mt*GWP_N2O","v":0},{"$f":"H184*Factors!P193*g_kg*kg_mt*GWP_N2O","v":0},0]
[null,1996,{"$f":"SUMIFS('Mobile-Data'!$I$9:$I$1048576,'Mobile-Data'!$D$9:$D$1048576,$B185,'Mobile-Data'!$E$9:$E$1048576,'Mobile-Detail Calcs'!C$167,'Mobile-Data'!$G$9:$G$1048576,'Mobile-Detail Calcs'!C$168,'Mobile-Data'!$C$9:$C$1048576,'Mobile-Detail Calcs'!$C$162)","v":0},{"$f":"SUMIFS('Mobile-Data'!$I$9:$I$1048576,'Mobile-Data'!$D$9:$D$1048576,$B185,'Mobile-Data'!$E$9:$E$1048576,'Mobile-Detail Calcs'!D$167,'Mobile-Data'!$G$9:$G$1048576,'Mobile-Detail Calcs'!D$168,'Mobile-Data'!$C$9:$C$1048576,'Mobile-Detail Calcs'!$C$162)","v":0},{"$f":"SUMIFS('Mobile-Data'!$I$9:$I$1048576,'Mobile-Data'!$D$9:$D$1048576,$B185,'Mobile-Data'!$E$9:$E$1048576,'Mobile-Detail Calcs'!E$167,'Mobile-Data'!$G$9:$G$1048576,'Mobile-Detail Calcs'!E$168,'Mobile-Data'!$C$9:$C$1048576,'Mobile-Detail Calcs'!$C$162)","v":0},{"$f":"SUMIFS('Mobile-Data'!$I$9:$I$1048576,'Mobile-Data'!$D$9:$D$1048576,$B185,'Mobile-Data'!$E$9:$E$1048576,'Mobile-Detail Calcs'!F$167,'Mobile-Data'!$G$9:$G$1048576,'Mobile-Detail Calcs'!F$168,'Mobile-Data'!$C$9:$C$1048576,'Mobile-Detail Calcs'!$C$162)","v":0},{"$f":"SUMIFS('Mobile-Data'!$I$9:$I$1048576,'Mobile-Data'!$D$9:$D$1048576,$B185,'Mobile-Data'!$E$9:$E$1048576,'Mobile-Detail Calcs'!G$167,'Mobile-Data'!$G$9:$G$1048576,'Mobile-Detail Calcs'!G$168,'Mobile-Data'!$C$9:$C$1048576,'Mobile-Detail Calcs'!$C$162)","v":0},{"$f":"SUMIFS('Mobile-Data'!$I$9:$I$1048576,'Mobile-Data'!$D$9:$D$1048576,$B185,'Mobile-Data'!$E$9:$E$1048576,'Mobile-Detail Calcs'!H$167,'Mobile-Data'!$G$9:$G$1048576,'Mobile-Detail Calcs'!H$168,'Mobile-Data'!$C$9:$C$1048576,'Mobile-Detail Calcs'!$C$162)","v":0},0,null,1996,{"$f":"C185*Factors!C194*g_kg*kg_mt*GWP_CH4","v":0},{"$f":"D185*Factors!D194*g_kg*kg_mt*GWP_CH4","v":0},{"$f":"E185*Factors!E194*g_kg*kg_mt*GWP_CH4","v":0},{"$f":"F185*Factors!F194*g_kg*kg_mt*GWP_CH4","v":0},{"$f":"G185*Factors!G194*g_kg*kg_mt*GWP_CH4","v":0},{"$f":"H185*Factors!H194*g_kg*kg_mt*GWP_CH4","v":0},0,null,1996,{"$f":"C185*Factors!K194*g_kg*kg_mt*GWP_N2O","v":0},{"$f":"D185*Factors!L194*g_kg*kg_mt*GWP_N2O","v":0},{"$f":"E185*Factors!M194*g_kg*kg_mt*GWP_N2O","v":0},{"$f":"F185*Factors!N194*g_kg*kg_mt*GWP_N2O","v":0},{"$f":"G185*Factors!O194*g_kg*kg_mt*GWP_N2O","v":0},{"$f":"H185*Factors!P194*g_kg*kg_mt*GWP_N2O","v":0},0]
[null,1997,{"$f":"SUMIFS('Mobile-Data'!$I$9:$I$1048576,'Mobile-Data'!$D$9:$D$1048576,$B186,'Mobile-Data'!$E$9:$E$1048576,'Mobile-Detail Calcs'!C$167,'Mobile-Data'!$G$9:$G$1048576,'Mobile-Detail Calcs'!C$168,'Mobile-Data'!$C$9:$C$1048576,'Mobile-Detail Calcs'!$C$162)","v":0},{"$f":"SUMIFS('Mobile-Data'!$I$9:$I$1048576,'Mobile-Data'!$D$9:$D$1048576,$B186,'Mobile-Data'!$E$9:$E$1048576,'Mobile-Detail Calcs'!D$167,'Mobile-Data'!$G$9:$G$1048576,'Mobile-Detail Calcs'!D$168,'Mobile-Data'!$C$9:$C$1048576,'Mobile-Detail Calcs'!$C$162)","v":0},{"$f":"SUMIFS('Mobile-Data'!$I$9:$I$1048576,'Mobile-Data'!$D$9:$D$1048576,$B186,'Mobile-Data'!$E$9:$E$1048576,'Mobile-Detail Calcs'!E$167,'Mobile-Data'!$G$9:$G$1048576,'Mobile-Detail Calcs'!E$168,'Mobile-Data'!$C$9:$C$1048576,'Mobile-Detail Calcs'!$C$162)","v":0},{"$f":"SUMIFS('Mobile-Data'!$I$9:$I$1048576,'Mobile-Data'!$D$9:$D$1048576,$B186,'Mobile-Data'!$E$9:$E$1048576,'Mobile-Detail Calcs'!F$167,'Mobile-Data'!$G$9:$G$1048576,'Mobile-Detail Calcs'!F$168,'Mobile-Data'!$C$9:$C$1048576,'Mobile-Detail Calcs'!$C$162)","v":0},{"$f":"SUMIFS('Mobile-Data'!$I$9:$I$1048576,'Mobile-Data'!$D$9:$D$1048576,$B186,'Mobile-Data'!$E$9:$E$1048576,'Mobile-Detail Calcs'!G$167,'Mobile-Data'!$G$9:$G$1048576,'Mobile-Detail Calcs'!G$168,'Mobile-Data'!$C$9:$C$1048576,'Mobile-Detail Calcs'!$C$162)","v":0},{"$f":"SUMIFS('Mobile-Data'!$I$9:$I$1048576,'Mobile-Data'!$D$9:$D$1048576,$B186,'Mobile-Data'!$E$9:$E$1048576,'Mobile-Detail Calcs'!H$167,'Mobile-Data'!$G$9:$G$1048576,'Mobile-Detail Calcs'!H$168,'Mobile-Data'!$C$9:$C$1048576,'Mobile-Detail Calcs'!$C$162)","v":0},0,null,1997,{"$f":"C186*Factors!C195*g_kg*kg_mt*GWP_CH4","v":0},{"$f":"D186*Factors!D195*g_kg*kg_mt*GWP_CH4","v":0},{"$f":"E186*Factors!E195*g_kg*kg_mt*GWP_CH4","v":0},{"$f":"F186*Factors!F195*g_kg*kg_mt*GWP_CH4","v":0},{"$f":"G186*Factors!G195*g_kg*kg_mt*GWP_CH4","v":0},{"$f":"H186*Factors!H195*g_kg*kg_mt*GWP_CH4","v":0},0,null,1997,{"$f":"C186*Factors!K195*g_kg*kg_mt*GWP_N2O","v":0},{"$f":"D186*Factors!L195*g_kg*kg_mt*GWP_N2O","v":0},{"$f":"E186*Factors!M195*g_kg*kg_mt*GWP_N2O","v":0},{"$f":"F186*Factors!N195*g_kg*kg_mt*GWP_N2O","v":0},{"$f":"G186*Factors!O195*g_kg*kg_mt*GWP_N2O","v":0},{"$f":"H186*Factors!P195*g_kg*kg_mt*GWP_N2O","v":0},0]
[null,1998,{"$f":"SUMIFS('Mobile-Data'!$I$9:$I$1048576,'Mobile-Data'!$D$9:$D$1048576,$B187,'Mobile-Data'!$E$9:$E$1048576,'Mobile-Detail Calcs'!C$167,'Mobile-Data'!$G$9:$G$1048576,'Mobile-Detail Calcs'!C$168,'Mobile-Data'!$C$9:$C$1048576,'Mobile-Detail Calcs'!$C$162)","v":0},{"$f":"SUMIFS('Mobile-Data'!$I$9:$I$1048576,'Mobile-Data'!$D$9:$D$1048576,$B187,'Mobile-Data'!$E$9:$E$1048576,'Mobile-Detail Calcs'!D$167,'Mobile-Data'!$G$9:$G$1048576,'Mobile-Detail Calcs'!D$168,'Mobile-Data'!$C$9:$C$1048576,'Mobile-Detail Calcs'!$C$162)","v":0},{"$f":"SUMIFS('Mobile-Data'!$I$9:$I$1048576,'Mobile-Data'!$D$9:$D$1048576,$B187,'Mobile-Data'!$E$9:$E$1048576,'Mobile-Detail Calcs'!E$167,'Mobile-Data'!$G$9:$G$1048576,'Mobile-Detail Calcs'!E$168,'Mobile-Data'!$C$9:$C$1048576,'Mobile-Detail Calcs'!$C$162)","v":0},{"$f":"SUMIFS('Mobile-Data'!$I$9:$I$1048576,'Mobile-Data'!$D$9:$D$1048576,$B187,'Mobile-Data'!$E$9:$E$1048576,'Mobile-Detail Calcs'!F$167,'Mobile-Data'!$G$9:$G$1048576,'Mobile-Detail Calcs'!F$168,'Mobile-Data'!$C$9:$C$1048576,'Mobile-Detail Calcs'!$C$162)","v":0},{"$f":"SUMIFS('Mobile-Data'!$I$9:$I$1048576,'Mobile-Data'!$D$9:$D$1048576,$B187,'Mobile-Data'!$E$9:$E$1048576,'Mobile-Detail Calcs'!G$167,'Mobile-Data'!$G$9:$G$1048576,'Mobile-Detail Calcs'!G$168,'Mobile-Data'!$C$9:$C$1048576,'Mobile-Detail Calcs'!$C$162)","v":0},{"$f":"SUMIFS('Mobile-Data'!$I$9:$I$1048576,'Mobile-Data'!$D$9:$D$1048576,$B187,'Mobile-Data'!$E$9:$E$1048576,'Mobile-Detail Calcs'!H$167,'Mobile-Data'!$G$9:$G$1048576,'Mobile-Detail Calcs'!H$168,'Mobile-Data'!$C$9:$C$1048576,'Mobile-Detail Calcs'!$C$162)","v":0},0,null,1998,{"$f":"C187*Factors!C196*g_kg*kg_mt*GWP_CH4","v":0},{"$f":"D187*Factors!D196*g_kg*kg_mt*GWP_CH4","v":0},{"$f":"E187*Factors!E196*g_kg*kg_mt*GWP_CH4","v":0},{"$f":"F187*Factors!F196*g_kg*kg_mt*GWP_CH4","v":0},{"$f":"G187*Factors!G196*g_kg*kg_mt*GWP_CH4","v":0},{"$f":"H187*Factors!H196*g_kg*kg_mt*GWP_CH4","v":0},0,null,1998,{"$f":"C187*Factors!K196*g_kg*kg_mt*GWP_N2O","v":0},{"$f":"D187*Factors!L196*g_kg*kg_mt*GWP_N2O","v":0},{"$f":"E187*Factors!M196*g_kg*kg_mt*GWP_N2O","v":0},{"$f":"F187*Factors!N196*g_kg*kg_mt*GWP_N2O","v":0},{"$f":"G187*Factors!O196*g_kg*kg_mt*GWP_N2O","v":0},{"$f":"H187*Factors!P196*g_kg*kg_mt*GWP_N2O","v":0},0]
[null,1999,{"$f":"SUMIFS('Mobile-Data'!$I$9:$I$1048576,'Mobile-Data'!$D$9:$D$1048576,$B188,'Mobile-Data'!$E$9:$E$1048576,'Mobile-Detail Calcs'!C$167,'Mobile-Data'!$G$9:$G$1048576,'Mobile-Detail Calcs'!C$168,'Mobile-Data'!$C$9:$C$1048576,'Mobile-Detail Calcs'!$C$162)","v":0},{"$f":"SUMIFS('Mobile-Data'!$I$9:$I$1048576,'Mobile-Data'!$D$9:$D$1048576,$B188,'Mobile-Data'!$E$9:$E$1048576,'Mobile-Detail Calcs'!D$167,'Mobile-Data'!$G$9:$G$1048576,'Mobile-Detail Calcs'!D$168,'Mobile-Data'!$C$9:$C$1048576,'Mobile-Detail Calcs'!$C$162)","v":0},{"$f":"SUMIFS('Mobile-Data'!$I$9:$I$1048576,'Mobile-Data'!$D$9:$D$1048576,$B188,'Mobile-Data'!$E$9:$E$1048576,'Mobile-Detail Calcs'!E$167,'Mobile-Data'!$G$9:$G$1048576,'Mobile-Detail Calcs'!E$168,'Mobile-Data'!$C$9:$C$1048576,'Mobile-Detail Calcs'!$C$162)","v":0},{"$f":"SUMIFS('Mobile-Data'!$I$9:$I$1048576,'Mobile-Data'!$D$9:$D$1048576,$B188,'Mobile-Data'!$E$9:$E$1048576,'Mobile-Detail Calcs'!F$167,'Mobile-Data'!$G$9:$G$1048576,'Mobile-Detail Calcs'!F$168,'Mobile-Data'!$C$9:$C$1048576,'Mobile-Detail Calcs'!$C$162)","v":0},{"$f":"SUMIFS('Mobile-Data'!$I$9:$I$1048576,'Mobile-Data'!$D$9:$D$1048576,$B188,'Mobile-Data'!$E$9:$E$1048576,'Mobile-Detail Calcs'!G$167,'Mobile-Data'!$G$9:$G$1048576,'Mobile-Detail Calcs'!G$168,'Mobile-Data'!$C$9:$C$1048576,'Mobile-Detail Calcs'!$C$162)","v":0},{"$f":"SUMIFS('Mobile-Data'!$I$9:$I$1048576,'Mobile-Data'!$D$9:$D$1048576,$B188,'Mobile-Data'!$E$9:$E$1048576,'Mobile-Detail Calcs'!H$167,'Mobile-Data'!$G$9:$G$1048576,'Mobile-Detail Calcs'!H$168,'Mobile-Data'!$C$9:$C$1048576,'Mobile-Detail Calcs'!$C$162)","v":0},0,null,1999,{"$f":"C188*Factors!C197*g_kg*kg_mt*GWP_CH4","v":0},{"$f":"D188*Factors!D197*g_kg*kg_mt*GWP_CH4","v":0},{"$f":"E188*Factors!E197*g_kg*kg_mt*GWP_CH4","v":0},{"$f":"F188*Factors!F197*g_kg*kg_mt*GWP_CH4","v":0},{"$f":"G188*Factors!G197*g_kg*kg_mt*GWP_CH4","v":0},{"$f":"H188*Factors!H197*g_kg*kg_mt*GWP_CH4","v":0},0,null,1999,{"$f":"C188*Factors!K197*g_kg*kg_mt*GWP_N2O","v":0},{"$f":"D188*Factors!L197*g_kg*kg_mt*GWP_N2O","v":0},{"$f":"E188*Factors!M197*g_kg*kg_mt*GWP_N2O","v":0},{"$f":"F188*Factors!N197*g_kg*kg_mt*GWP_N2O","v":0},{"$f":"G188*Factors!O197*g_kg*kg_mt*GWP_N2O","v":0},{"$f":"H188*Factors!P197*g_kg*kg_mt*GWP_N2O","v":0},0]
[null,2000,{"$f":"SUMIFS('Mobile-Data'!$I$9:$I$1048576,'Mobile-Data'!$D$9:$D$1048576,$B189,'Mobile-Data'!$E$9:$E$1048576,'Mobile-Detail Calcs'!C$167,'Mobile-Data'!$G$9:$G$1048576,'Mobile-Detail Calcs'!C$168,'Mobile-Data'!$C$9:$C$1048576,'Mobile-Detail Calcs'!$C$162)","v":0},{"$f":"SUMIFS('Mobile-Data'!$I$9:$I$1048576,'Mobile-Data'!$D$9:$D$1048576,$B189,'Mobile-Data'!$E$9:$E$1048576,'Mobile-Detail Calcs'!D$167,'Mobile-Data'!$G$9:$G$1048576,'Mobile-Detail Calcs'!D$168,'Mobile-Data'!$C$9:$C$1048576,'Mobile-Detail Calcs'!$C$162)","v":0},{"$f":"SUMIFS('Mobile-Data'!$I$9:$I$1048576,'Mobile-Data'!$D$9:$D$1048576,$B189,'Mobile-Data'!$E$9:$E$1048576,'Mobile-Detail Calcs'!E$167,'Mobile-Data'!$G$9:$G$1048576,'Mobile-Detail Calcs'!E$168,'Mobile-Data'!$C$9:$C$1048576,'Mobile-Detail Calcs'!$C$162)","v":0},{"$f":"SUMIFS('Mobile-Data'!$I$9:$I$1048576,'Mobile-Data'!$D$9:$D$1048576,$B189,'Mobile-Data'!$E$9:$E$1048576,'Mobile-Detail Calcs'!F$167,'Mobile-Data'!$G$9:$G$1048576,'Mobile-Detail Calcs'!F$168,'Mobile-Data'!$C$9:$C$1048576,'Mobile-Detail Calcs'!$C$162)","v":0},{"$f":"SUMIFS('Mobile-Data'!$I$9:$I$1048576,'Mobile-Data'!$D$9:$D$1048576,$B189,'Mobile-Data'!$E$9:$E$1048576,'Mobile-Detail Calcs'!G$167,'Mobile-Data'!$G$9:$G$1048576,'Mobile-Detail Calcs'!G$168,'Mobile-Data'!$C$9:$C$1048576,'Mobile-Detail Calcs'!$C$162)","v":0},{"$f":"SUMIFS('Mobile-Data'!$I$9:$I$1048576,'Mobile-Data'!$D$9:$D$1048576,$B189,'Mobile-Data'!$E$9:$E$1048576,'Mobile-Detail Calcs'!H$167,'Mobile-Data'!$G$9:$G$1048576,'Mobile-Detail Calcs'!H$168,'Mobile-Data'!$C$9:$C$1048576,'Mobile-Detail Calcs'!$C$162)","v":0},0,null,2000,{"$f":"C189*Factors!C198*g_kg*kg_mt*GWP_CH4","v":0},{"$f":"D189*Factors!D198*g_kg*kg_mt*GWP_CH4","v":0},{"$f":"E189*Factors!E198*g_kg*kg_mt*GWP_CH4","v":0},{"$f":"F189*Factors!F198*g_kg*kg_mt*GWP_CH4","v":0},{"$f":"G189*Factors!G198*g_kg*kg_mt*GWP_CH4","v":0},{"$f":"H189*Factors!H198*g_kg*kg_mt*GWP_CH4","v":0},0,null,2000,{"$f":"C189*Factors!K198*g_kg*kg_mt*GWP_N2O","v":0},{"$f":"D189*Factors!L198*g_kg*kg_mt*GWP_N2O","v":0},{"$f":"E189*Factors!M198*g_kg*kg_mt*GWP_N2O","v":0},{"$f":"F189*Factors!N198*g_kg*kg_mt*GWP_N2O","v":0},{"$f":"G189*Factors!O198*g_kg*kg_mt*GWP_N2O","v":0},{"$f":"H189*Factors!P198*g_kg*kg_mt*GWP_N2O","v":0},0]
[null,2001,{"$f":"SUMIFS('Mobile-Data'!$I$9:$I$1048576,'Mobile-Data'!$D$9:$D$1048576,$B190,'Mobile-Data'!$E$9:$E$1048576,'Mobile-Detail Calcs'!C$167,'Mobile-Data'!$G$9:$G$1048576,'Mobile-Detail Calcs'!C$168,'Mobile-Data'!$C$9:$C$1048576,'Mobile-Detail Calcs'!$C$162)","v":0},{"$f":"SUMIFS('Mobile-Data'!$I$9:$I$1048576,'Mobile-Data'!$D$9:$D$1048576,$B190,'Mobile-Data'!$E$9:$E$1048576,'Mobile-Detail Calcs'!D$167,'Mobile-Data'!$G$9:$G$1048576,'Mobile-Detail Calcs'!D$168,'Mobile-Data'!$C$9:$C$1048576,'Mobile-Detail Calcs'!$C$162)","v":0},{"$f":"SUMIFS('Mobile-Data'!$I$9:$I$1048576,'Mobile-Data'!$D$9:$D$1048576,$B190,'Mobile-Data'!$E$9:$E$1048576,'Mobile-Detail Calcs'!E$167,'Mobile-Data'!$G$9:$G$1048576,'Mobile-Detail Calcs'!E$168,'Mobile-Data'!$C$9:$C$1048576,'Mobile-Detail Calcs'!$C$162)","v":0},{"$f":"SUMIFS('Mobile-Data'!$I$9:$I$1048576,'Mobile-Data'!$D$9:$D$1048576,$B190,'Mobile-Data'!$E$9:$E$1048576,'Mobile-Detail Calcs'!F$167,'Mobile-Data'!$G$9:$G$1048576,'Mobile-Detail Calcs'!F$168,'Mobile-Data'!$C$9:$C$1048576,'Mobile-Detail Calcs'!$C$162)","v":0},{"$f":"SUMIFS('Mobile-Data'!$I$9:$I$1048576,'Mobile-Data'!$D$9:$D$1048576,$B190,'Mobile-Data'!$E$9:$E$1048576,'Mobile-Detail Calcs'!G$167,'Mobile-Data'!$G$9:$G$1048576,'Mobile-Detail Calcs'!G$168,'Mobile-Data'!$C$9:$C$1048576,'Mobile-Detail Calcs'!$C$162)","v":0},{"$f":"SUMIFS('Mobile-Data'!$I$9:$I$1048576,'Mobile-Data'!$D$9:$D$1048576,$B190,'Mobile-Data'!$E$9:$E$1048576,'Mobile-Detail Calcs'!H$167,'Mobile-Data'!$G$9:$G$1048576,'Mobile-Detail Calcs'!H$168,'Mobile-Data'!$C$9:$C$1048576,'Mobile-Detail Calcs'!$C$162)","v":0},0,null,2001,{"$f":"C190*Factors!C199*g_kg*kg_mt*GWP_CH4","v":0},{"$f":"D190*Factors!D199*g_kg*kg_mt*GWP_CH4","v":0},{"$f":"E190*Factors!E199*g_kg*kg_mt*GWP_CH4","v":0},{"$f":"F190*Factors!F199*g_kg*kg_mt*GWP_CH4","v":0},{"$f":"G190*Factors!G199*g_kg*kg_mt*GWP_CH4","v":0},{"$f":"H190*Factors!H199*g_kg*kg_mt*GWP_CH4","v":0},0,null,2001,{"$f":"C190*Factors!K199*g_kg*kg_mt*GWP_N2O","v":0},{"$f":"D190*Factors!L199*g_kg*kg_mt*GWP_N2O","v":0},{"$f":"E190*Factors!M199*g_kg*kg_mt*GWP_N2O","v":0},{"$f":"F190*Factors!N199*g_kg*kg_mt*GWP_N2O","v":0},{"$f":"G190*Factors!O199*g_kg*kg_mt*GWP_N2O","v":0},{"$f":"H190*Factors!P199*g_kg*kg_mt*GWP_N2O","v":0},0]
[null,2002,{"$f":"SUMIFS('Mobile-Data'!$I$9:$I$1048576,'Mobile-Data'!$D$9:$D$1048576,$B191,'Mobile-Data'!$E$9:$E$1048576,'Mobile-Detail Calcs'!C$167,'Mobile-Data'!$G$9:$G$1048576,'Mobile-Detail Calcs'!C$168,'Mobile-Data'!$C$9:$C$1048576,'Mobile-Detail Calcs'!$C$162)","v":0},{"$f":"SUMIFS('Mobile-Data'!$I$9:$I$1048576,'Mobile-Data'!$D$9:$D$1048576,$B191,'Mobile-Data'!$E$9:$E$1048576,'Mobile-Detail Calcs'!D$167,'Mobile-Data'!$G$9:$G$1048576,'Mobile-Detail Calcs'!D$168,'Mobile-Data'!$C$9:$C$1048576,'Mobile-Detail Calcs'!$C$162)","v":0},{"$f":"SUMIFS('Mobile-Data'!$I$9:$I$1048576,'Mobile-Data'!$D$9:$D$1048576,$B191,'Mobile-Data'!$E$9:$E$1048576,'Mobile-Detail Calcs'!E$167,'Mobile-Data'!$G$9:$G$1048576,'Mobile-Detail Calcs'!E$168,'Mobile-Data'!$C$9:$C$1048576,'Mobile-Detail Calcs'!$C$162)","v":0},{"$f":"SUMIFS('Mobile-Data'!$I$9:$I$1048576,'Mobile-Data'!$D$9:$D$1048576,$B191,'Mobile-Data'!$E$9:$E$1048576,'Mobile-Detail Calcs'!F$167,'Mobile-Data'!$G$9:$G$1048576,'Mobile-Detail Calcs'!F$168,'Mobile-Data'!$C$9:$C$1048576,'Mobile-Detail Calcs'!$C$162)","v":0},{"$f":"SUMIFS('Mobile-Data'!$I$9:$I$1048576,'Mobile-Data'!$D$9:$D$1048576,$B191,'Mobile-Data'!$E$9:$E$1048576,'Mobile-Detail Calcs'!G$167,'Mobile-Data'!$G$9:$G$1048576,'Mobile-Detail Calcs'!G$168,'Mobile-Data'!$C$9:$C$1048576,'Mobile-Detail Calcs'!$C$162)","v":0},{"$f":"SUMIFS('Mobile-Data'!$I$9:$I$1048576,'Mobile-Data'!$D$9:$D$1048576,$B191,'Mobile-Data'!$E$9:$E$1048576,'Mobile-Detail Calcs'!H$167,'Mobile-Data'!$G$9:$G$1048576,'Mobile-Detail Calcs'!H$168,'Mobile-Data'!$C$9:$C$1048576,'Mobile-Detail Calcs'!$C$162)","v":0},0,null,2002,{"$f":"C191*Factors!C200*g_kg*kg_mt*GWP_CH4","v":0},{"$f":"D191*Factors!D200*g_kg*kg_mt*GWP_CH4","v":0},{"$f":"E191*Factors!E200*g_kg*kg_mt*GWP_CH4","v":0},{"$f":"F191*Factors!F200*g_kg*kg_mt*GWP_CH4","v":0},{"$f":"G191*Factors!G200*g_kg*kg_mt*GWP_CH4","v":0},{"$f":"H191*Factors!H200*g_kg*kg_mt*GWP_CH4","v":0},0,null,2002,{"$f":"C191*Factors!K200*g_kg*kg_mt*GWP_N2O","v":0},{"$f":"D191*Factors!L200*g_kg*kg_mt*GWP_N2O","v":0},{"$f":"E191*Factors!M200*g_kg*kg_mt*GWP_N2O","v":0},{"$f":"F191*Factors!N200*g_kg*kg_mt*GWP_N2O","v":0},{"$f":"G191*Factors!O200*g_kg*kg_mt*GWP_N2O","v":0},{"$f":"H191*Factors!P200*g_kg*kg_mt*GWP_N2O","v":0},0]
[null,2003,{"$f":"SUMIFS('Mobile-Data'!$I$9:$I$1048576,'Mobile-Data'!$D$9:$D$1048576,$B192,'Mobile-Data'!$E$9:$E$1048576,'Mobile-Detail Calcs'!C$167,'Mobile-Data'!$G$9:$G$1048576,'Mobile-Detail Calcs'!C$168,'Mobile-Data'!$C$9:$C$1048576,'Mobile-Detail Calcs'!$C$162)","v":0},{"$f":"SUMIFS('Mobile-Data'!$I$9:$I$1048576,'Mobile-Data'!$D$9:$D$1048576,$B192,'Mobile-Data'!$E$9:$E$1048576,'Mobile-Detail Calcs'!D$167,'Mobile-Data'!$G$9:$G$1048576,'Mobile-Detail Calcs'!D$168,'Mobile-Data'!$C$9:$C$1048576,'Mobile-Detail Calcs'!$C$162)","v":0},{"$f":"SUMIFS('Mobile-Data'!$I$9:$I$1048576,'Mobile-Data'!$D$9:$D$1048576,$B192,'Mobile-Data'!$E$9:$E$1048576,'Mobile-Detail Calcs'!E$167,'Mobile-Data'!$G$9:$G$1048576,'Mobile-Detail Calcs'!E$168,'Mobile-Data'!$C$9:$C$1048576,'Mobile-Detail Calcs'!$C$162)","v":0},{"$f":"SUMIFS('Mobile-Data'!$I$9:$I$1048576,'Mobile-Data'!$D$9:$D$1048576,$B192,'Mobile-Data'!$E$9:$E$1048576,'Mobile-Detail Calcs'!F$167,'Mobile-Data'!$G$9:$G$1048576,'Mobile-Detail Calcs'!F$168,'Mobile-Data'!$C$9:$C$1048576,'Mobile-Detail Calcs'!$C$162)","v":0},{"$f":"SUMIFS('Mobile-Data'!$I$9:$I$1048576,'Mobile-Data'!$D$9:$D$1048576,$B192,'Mobile-Data'!$E$9:$E$1048576,'Mobile-Detail Calcs'!G$167,'Mobile-Data'!$G$9:$G$1048576,'Mobile-Detail Calcs'!G$168,'Mobile-Data'!$C$9:$C$1048576,'Mobile-Detail Calcs'!$C$162)","v":0},{"$f":"SUMIFS('Mobile-Data'!$I$9:$I$1048576,'Mobile-Data'!$D$9:$D$1048576,$B192,'Mobile-Data'!$E$9:$E$1048576,'Mobile-Detail Calcs'!H$167,'Mobile-Data'!$G$9:$G$1048576,'Mobile-Detail Calcs'!H$168,'Mobile-Data'!$C$9:$C$1048576,'Mobile-Detail Calcs'!$C$162)","v":0},0,null,2003,{"$f":"C192*Factors!C201*g_kg*kg_mt*GWP_CH4","v":0},{"$f":"D192*Factors!D201*g_kg*kg_mt*GWP_CH4","v":0},{"$f":"E192*Factors!E201*g_kg*kg_mt*GWP_CH4","v":0},{"$f":"F192*Factors!F201*g_kg*kg_mt*GWP_CH4","v":0},{"$f":"G192*Factors!G201*g_kg*kg_mt*GWP_CH4","v":0},{"$f":"H192*Factors!H201*g_kg*kg_mt*GWP_CH4","v":0},0,null,2003,{"$f":"C192*Factors!K201*g_kg*kg_mt*GWP_N2O","v":0},{"$f":"D192*Factors!L201*g_kg*kg_mt*GWP_N2O","v":0},{"$f":"E192*Factors!M201*g_kg*kg_mt*GWP_N2O","v":0},{"$f":"F192*Factors!N201*g_kg*kg_mt*GWP_N2O","v":0},{"$f":"G192*Factors!O201*g_kg*kg_mt*GWP_N2O","v":0},{"$f":"H192*Factors!P201*g_kg*kg_mt*GWP_N2O","v":0},0]
[null,2004,{"$f":"SUMIFS('Mobile-Data'!$I$9:$I$1048576,'Mobile-Data'!$D$9:$D$1048576,$B193,'Mobile-Data'!$E$9:$E$1048576,'Mobile-Detail Calcs'!C$167,'Mobile-Data'!$G$9:$G$1048576,'Mobile-Detail Calcs'!C$168,'Mobile-Data'!$C$9:$C$1048576,'Mobile-Detail Calcs'!$C$162)","v":0},{"$f":"SUMIFS('Mobile-Data'!$I$9:$I$1048576,'Mobile-Data'!$D$9:$D$1048576,$B193,'Mobile-Data'!$E$9:$E$1048576,'Mobile-Detail Calcs'!D$167,'Mobile-Data'!$G$9:$G$1048576,'Mobile-Detail Calcs'!D$168,'Mobile-Data'!$C$9:$C$1048576,'Mobile-Detail Calcs'!$C$162)","v":0},{"$f":"SUMIFS('Mobile-Data'!$I$9:$I$1048576,'Mobile-Data'!$D$9:$D$1048576,$B193,'Mobile-Data'!$E$9:$E$1048576,'Mobile-Detail Calcs'!E$167,'Mobile-Data'!$G$9:$G$1048576,'Mobile-Detail Calcs'!E$168,'Mobile-Data'!$C$9:$C$1048576,'Mobile-Detail Calcs'!$C$162)","v":0},{"$f":"SUMIFS('Mobile-Data'!$I$9:$I$1048576,'Mobile-Data'!$D$9:$D$1048576,$B193,'Mobile-Data'!$E$9:$E$1048576,'Mobile-Detail Calcs'!F$167,'Mobile-Data'!$G$9:$G$1048576,'Mobile-Detail Calcs'!F$168,'Mobile-Data'!$C$9:$C$1048576,'Mobile-Detail Calcs'!$C$162)","v":0},{"$f":"SUMIFS('Mobile-Data'!$I$9:$I$1048576,'Mobile-Data'!$D$9:$D$1048576,$B193,'Mobile-Data'!$E$9:$E$1048576,'Mobile-Detail Calcs'!G$167,'Mobile-Data'!$G$9:$G$1048576,'Mobile-Detail Calcs'!G$168,'Mobile-Data'!$C$9:$C$1048576,'Mobile-Detail Calcs'!$C$162)","v":0},{"$f":"SUMIFS('Mobile-Data'!$I$9:$I$1048576,'Mobile-Data'!$D$9:$D$1048576,$B193,'Mobile-Data'!$E$9:$E$1048576,'Mobile-Detail Calcs'!H$167,'Mobile-Data'!$G$9:$G$1048576,'Mobile-Detail Calcs'!H$168,'Mobile-Data'!$C$9:$C$1048576,'Mobile-Detail Calcs'!$C$162)","v":0},0,null,2004,{"$f":"C193*Factors!C202*g_kg*kg_mt*GWP_CH4","v":0},{"$f":"D193*Factors!D202*g_kg*kg_mt*GWP_CH4","v":0},{"$f":"E193*Factors!E202*g_kg*kg_mt*GWP_CH4","v":0},{"$f":"F193*Factors!F202*g_kg*kg_mt*GWP_CH4","v":0},{"$f":"G193*Factors!G202*g_kg*kg_mt*GWP_CH4","v":0},{"$f":"H193*Factors!H202*g_kg*kg_mt*GWP_CH4","v":0},0,null,2004,{"$f":"C193*Factors!K202*g_kg*kg_mt*GWP_N2O","v":0},{"$f":"D193*Factors!L202*g_kg*kg_mt*GWP_N2O","v":0},{"$f":"E193*Factors!M202*g_kg*kg_mt*GWP_N2O","v":0},{"$f":"F193*Factors!N202*g_kg*kg_mt*GWP_N2O","v":0},{"$f":"G193*Factors!O202*g_kg*kg_mt*GWP_N2O","v":0},{"$f":"H193*Factors!P202*g_kg*kg_mt*GWP_N2O","v":0},0]
[null,2005,{"$f":"SUMIFS('Mobile-Data'!$I$9:$I$1048576,'Mobile-Data'!$D$9:$D$1048576,$B194,'Mobile-Data'!$E$9:$E$1048576,'Mobile-Detail Calcs'!C$167,'Mobile-Data'!$G$9:$G$1048576,'Mobile-Detail Calcs'!C$168,'Mobile-Data'!$C$9:$C$1048576,'Mobile-Detail Calcs'!$C$162)","v":0},{"$f":"SUMIFS('Mobile-Data'!$I$9:$I$1048576,'Mobile-Data'!$D$9:$D$1048576,$B194,'Mobile-Data'!$E$9:$E$1048576,'Mobile-Detail Calcs'!D$167,'Mobile-Data'!$G$9:$G$1048576,'Mobile-Detail Calcs'!D$168,'Mobile-Data'!$C$9:$C$1048576,'Mobile-Detail Calcs'!$C$162)","v":0},{"$f":"SUMIFS('Mobile-Data'!$I$9:$I$1048576,'Mobile-Data'!$D$9:$D$1048576,$B194,'Mobile-Data'!$E$9:$E$1048576,'Mobile-Detail Calcs'!E$167,'Mobile-Data'!$G$9:$G$1048576,'Mobile-Detail Calcs'!E$168,'Mobile-Data'!$C$9:$C$1048576,'Mobile-Detail Calcs'!$C$162)","v":0},{"$f":"SUMIFS('Mobile-Data'!$I$9:$I$1048576,'Mobile-Data'!$D$9:$D$1048576,$B194,'Mobile-Data'!$E$9:$E$1048576,'Mobile-Detail Calcs'!F$167,'Mobile-Data'!$G$9:$G$1048576,'Mobile-Detail Calcs'!F$168,'Mobile-Data'!$C$9:$C$1048576,'Mobile-Detail Calcs'!$C$162)","v":0},{"$f":"SUMIFS('Mobile-Data'!$I$9:$I$1048576,'Mobile-Data'!$D$9:$D$1048576,$B194,'Mobile-Data'!$E$9:$E$1048576,'Mobile-Detail Calcs'!G$167,'Mobile-Data'!$G$9:$G$1048576,'Mobile-Detail Calcs'!G$168,'Mobile-Data'!$C$9:$C$1048576,'Mobile-Detail Calcs'!$C$162)","v":0},{"$f":"SUMIFS('Mobile-Data'!$I$9:$I$1048576,'Mobile-Data'!$D$9:$D$1048576,$B194,'Mobile-Data'!$E$9:$E$1048576,'Mobile-Detail Calcs'!H$167,'Mobile-Data'!$G$9:$G$1048576,'Mobile-Detail Calcs'!H$168,'Mobile-Data'!$C$9:$C$1048576,'Mobile-Detail Calcs'!$C$162)","v":0},0,null,2005,{"$f":"C194*Factors!C203*g_kg*kg_mt*GWP_CH4","v":0},{"$f":"D194*Factors!D203*g_kg*kg_mt*GWP_CH4","v":0},{"$f":"E194*Factors!E203*g_kg*kg_mt*GWP_CH4","v":0},{"$f":"F194*Factors!F203*g_kg*kg_mt*GWP_CH4","v":0},{"$f":"G194*Factors!G203*g_kg*kg_mt*GWP_CH4","v":0},{"$f":"H194*Factors!H203*g_kg*kg_mt*GWP_CH4","v":0},0,null,2005,{"$f":"C194*Factors!K203*g_kg*kg_mt*GWP_N2O","v":0},{"$f":"D194*Factors!L203*g_kg*kg_mt*GWP_N2O","v":0},{"$f":"E194*Factors!M203*g_kg*kg_mt*GWP_N2O","v":0},{"$f":"F194*Factors!N203*g_kg*kg_mt*GWP_N2O","v":0},{"$f":"G194*Factors!O203*g_kg*kg_mt*GWP_N2O","v":0},{"$f":"H194*Factors!P203*g_kg*kg_mt*GWP_N2O","v":0},0]
[null,2006,{"$f":"SUMIFS('Mobile-Data'!$I$9:$I$1048576,'Mobile-Data'!$D$9:$D$1048576,$B195,'Mobile-Data'!$E$9:$E$1048576,'Mobile-Detail Calcs'!C$167,'Mobile-Data'!$G$9:$G$1048576,'Mobile-Detail Calcs'!C$168,'Mobile-Data'!$C$9:$C$1048576,'Mobile-Detail Calcs'!$C$162)","v":0},{"$f":"SUMIFS('Mobile-Data'!$I$9:$I$1048576,'Mobile-Data'!$D$9:$D$1048576,$B195,'Mobile-Data'!$E$9:$E$1048576,'Mobile-Detail Calcs'!D$167,'Mobile-Data'!$G$9:$G$1048576,'Mobile-Detail Calcs'!D$168,'Mobile-Data'!$C$9:$C$1048576,'Mobile-Detail Calcs'!$C$162)","v":0},{"$f":"SUMIFS('Mobile-Data'!$I$9:$I$1048576,'Mobile-Data'!$D$9:$D$1048576,$B195,'Mobile-Data'!$E$9:$E$1048576,'Mobile-Detail Calcs'!E$167,'Mobile-Data'!$G$9:$G$1048576,'Mobile-Detail Calcs'!E$168,'Mobile-Data'!$C$9:$C$1048576,'Mobile-Detail Calcs'!$C$162)","v":0},{"$f":"SUMIFS('Mobile-Data'!$I$9:$I$1048576,'Mobile-Data'!$D$9:$D$1048576,$B195,'Mobile-Data'!$E$9:$E$1048576,'Mobile-Detail Calcs'!F$167,'Mobile-Data'!$G$9:$G$1048576,'Mobile-Detail Calcs'!F$168,'Mobile-Data'!$C$9:$C$1048576,'Mobile-Detail Calcs'!$C$162)","v":0},{"$f":"SUMIFS('Mobile-Data'!$I$9:$I$1048576,'Mobile-Data'!$D$9:$D$1048576,$B195,'Mobile-Data'!$E$9:$E$1048576,'Mobile-Detail Calcs'!G$167,'Mobile-Data'!$G$9:$G$1048576,'Mobile-Detail Calcs'!G$168,'Mobile-Data'!$C$9:$C$1048576,'Mobile-Detail Calcs'!$C$162)","v":0},{"$f":"SUMIFS('Mobile-Data'!$I$9:$I$1048576,'Mobile-Data'!$D$9:$D$1048576,$B195,'Mobile-Data'!$E$9:$E$1048576,'Mobile-Detail Calcs'!H$167,'Mobile-Data'!$G$9:$G$1048576,'Mobile-Detail Calcs'!H$168,'Mobile-Data'!$C$9:$C$1048576,'Mobile-Detail Calcs'!$C$162)","v":0},0,null,2006,{"$f":"C195*Factors!C204*g_kg*kg_mt*GWP_CH4","v":0},{"$f":"D195*Factors!D204*g_kg*kg_mt*GWP_CH4","v":0},{"$f":"E195*Factors!E204*g_kg*kg_mt*GWP_CH4","v":0},{"$f":"F195*Factors!F204*g_kg*kg_mt*GWP_CH4","v":0},{"$f":"G195*Factors!G204*g_kg*kg_mt*GWP_CH4","v":0},{"$f":"H195*Factors!H204*g_kg*kg_mt*GWP_CH4","v":0},0,null,2006,{"$f":"C195*Factors!K204*g_kg*kg_mt*GWP_N2O","v":0},{"$f":"D195*Factors!L204*g_kg*kg_mt*GWP_N2O","v":0},{"$f":"E195*Factors!M204*g_kg*kg_mt*GWP_N2O","v":0},{"$f":"F195*Factors!N204*g_kg*kg_mt*GWP_N2O","v":0},{"$f":"G195*Factors!O204*g_kg*kg_mt*GWP_N2O","v":0},{"$f":"H195*Factors!P204*g_kg*kg_mt*GWP_N2O","v":0},0]
[null,2007,{"$f":"SUMIFS('Mobile-Data'!$I$9:$I$1048576,'Mobile-Data'!$D$9:$D$1048576,$B196,'Mobile-Data'!$E$9:$E$1048576,'Mobile-Detail Calcs'!C$167,'Mobile-Data'!$G$9:$G$1048576,'Mobile-Detail Calcs'!C$168,'Mobile-Data'!$C$9:$C$1048576,'Mobile-Detail Calcs'!$C$162)","v":0},{"$f":"SUMIFS('Mobile-Data'!$I$9:$I$1048576,'Mobile-Data'!$D$9:$D$1048576,$B196,'Mobile-Data'!$E$9:$E$1048576,'Mobile-Detail Calcs'!D$167,'Mobile-Data'!$G$9:$G$1048576,'Mobile-Detail Calcs'!D$168,'Mobile-Data'!$C$9:$C$1048576,'Mobile-Detail Calcs'!$C$162)","v":0},{"$f":"SUMIFS('Mobile-Data'!$I$9:$I$1048576,'Mobile-Data'!$D$9:$D$1048576,$B196,'Mobile-Data'!$E$9:$E$1048576,'Mobile-Detail Calcs'!E$167,'Mobile-Data'!$G$9:$G$1048576,'Mobile-Detail Calcs'!E$168,'Mobile-Data'!$C$9:$C$1048576,'Mobile-Detail Calcs'!$C$162)","v":0},{"$f":"SUMIFS('Mobile-Data'!$I$9:$I$1048576,'Mobile-Data'!$D$9:$D$1048576,$B196,'Mobile-Data'!$E$9:$E$1048576,'Mobile-Detail Calcs'!F$167,'Mobile-Data'!$G$9:$G$1048576,'Mobile-Detail Calcs'!F$168,'Mobile-Data'!$C$9:$C$1048576,'Mobile-Detail Calcs'!$C$162)","v":0},{"$f":"SUMIFS('Mobile-Data'!$I$9:$I$1048576,'Mobile-Data'!$D$9:$D$1048576,$B196,'Mobile-Data'!$E$9:$E$1048576,'Mobile-Detail Calcs'!G$167,'Mobile-Data'!$G$9:$G$1048576,'Mobile-Detail Calcs'!G$168,'Mobile-Data'!$C$9:$C$1048576,'Mobile-Detail Calcs'!$C$162)","v":0},{"$f":"SUMIFS('Mobile-Data'!$I$9:$I$1048576,'Mobile-Data'!$D$9:$D$1048576,$B196,'Mobile-Data'!$E$9:$E$1048576,'Mobile-Detail Calcs'!H$167,'Mobile-Data'!$G$9:$G$1048576,'Mobile-Detail Calcs'!H$168,'Mobile-Data'!$C$9:$C$1048576,'Mobile-Detail Calcs'!$C$162)","v":0},0,null,2007,{"$f":"C196*Factors!C205*g_kg*kg_mt*GWP_CH4","v":0},{"$f":"D196*Factors!D205*g_kg*kg_mt*GWP_CH4","v":0},{"$f":"E196*Factors!E205*g_kg*kg_mt*GWP_CH4","v":0},{"$f":"F196*Factors!F205*g_kg*kg_mt*GWP_CH4","v":0},{"$f":"G196*Factors!G205*g_kg*kg_mt*GWP_CH4","v":0},{"$f":"H196*Factors!H205*g_kg*kg_mt*GWP_CH4","v":0},0,null,2007,{"$f":"C196*Factors!K205*g_kg*kg_mt*GWP_N2O","v":0},{"$f":"D196*Factors!L205*g_kg*kg_mt*GWP_N2O","v":0},{"$f":"E196*Factors!M205*g_kg*kg_mt*GWP_N2O","v":0},{"$f":"F196*Factors!N205*g_kg*kg_mt*GWP_N2O","v":0},{"$f":"G196*Factors!O205*g_kg*kg_mt*GWP_N2O","v":0},{"$f":"H196*Factors!P205*g_kg*kg_mt*GWP_N2O","v":0},0]
[null,2008,{"$f":"SUMIFS('Mobile-Data'!$I$9:$I$1048576,'Mobile-Data'!$D$9:$D$1048576,$B197,'Mobile-Data'!$E$9:$E$1048576,'Mobile-Detail Calcs'!C$167,'Mobile-Data'!$G$9:$G$1048576,'Mobile-Detail Calcs'!C$168,'Mobile-Data'!$C$9:$C$1048576,'Mobile-Detail Calcs'!$C$162)","v":0},{"$f":"SUMIFS('Mobile-Data'!$I$9:$I$1048576,'Mobile-Data'!$D$9:$D$1048576,$B197,'Mobile-Data'!$E$9:$E$1048576,'Mobile-Detail Calcs'!D$167,'Mobile-Data'!$G$9:$G$1048576,'Mobile-Detail Calcs'!D$168,'Mobile-Data'!$C$9:$C$1048576,'Mobile-Detail Calcs'!$C$162)","v":0},{"$f":"SUMIFS('Mobile-Data'!$I$9:$I$1048576,'Mobile-Data'!$D$9:$D$1048576,$B197,'Mobile-Data'!$E$9:$E$1048576,'Mobile-Detail Calcs'!E$167,'Mobile-Data'!$G$9:$G$1048576,'Mobile-Detail Calcs'!E$168,'Mobile-Data'!$C$9:$C$1048576,'Mobile-Detail Calcs'!$C$162)","v":0},{"$f":"SUMIFS('Mobile-Data'!$I$9:$I$1048576,'Mobile-Data'!$D$9:$D$1048576,$B197,'Mobile-Data'!$E$9:$E$1048576,'Mobile-Detail Calcs'!F$167,'Mobile-Data'!$G$9:$G$1048576,'Mobile-Detail Calcs'!F$168,'Mobile-Data'!$C$9:$C$1048576,'Mobile-Detail Calcs'!$C$162)","v":0},{"$f":"SUMIFS('Mobile-Data'!$I$9:$I$1048576,'Mobile-Data'!$D$9:$D$1048576,$B197,'Mobile-Data'!$E$9:$E$1048576,'Mobile-Detail Calcs'!G$167,'Mobile-Data'!$G$9:$G$1048576,'Mobile-Detail Calcs'!G$168,'Mobile-Data'!$C$9:$C$1048576,'Mobile-Detail Calcs'!$C$162)","v":0},{"$f":"SUMIFS('Mobile-Data'!$I$9:$I$1048576,'Mobile-Data'!$D$9:$D$1048576,$B197,'Mobile-Data'!$E$9:$E$1048576,'Mobile-Detail Calcs'!H$167,'Mobile-Data'!$G$9:$G$1048576,'Mobile-Detail Calcs'!H$168,'Mobile-Data'!$C$9:$C$1048576,'Mobile-Detail Calcs'!$C$162)","v":0},0,null,2008,{"$f":"C197*Factors!C206*g_kg*kg_mt*GWP_CH4","v":0},{"$f":"D197*Factors!D206*g_kg*kg_mt*GWP_CH4","v":0},{"$f":"E197*Factors!E206*g_kg*kg_mt*GWP_CH4","v":0},{"$f":"F197*Factors!F206*g_kg*kg_mt*GWP_CH4","v":0},{"$f":"G197*Factors!G206*g_kg*kg_mt*GWP_CH4","v":0},{"$f":"H197*Factors!H206*g_kg*kg_mt*GWP_CH4","v":0},0,null,2008,{"$f":"C197*Factors!K206*g_kg*kg_mt*GWP_N2O","v":0},{"$f":"D197*Factors!L206*g_kg*kg_mt*GWP_N2O","v":0},{"$f":"E197*Factors!M206*g_kg*kg_mt*GWP_N2O","v":0},{"$f":"F197*Factors!N206*g_kg*kg_mt*GWP_N2O","v":0},{"$f":"G197*Factors!O206*g_kg*kg_mt*GWP_N2O","v":0},{"$f":"H197*Factors!P206*g_kg*kg_mt*GWP_N2O","v":0},0]
[null,2009,{"$f":"SUMIFS('Mobile-Data'!$I$9:$I$1048576,'Mobile-Data'!$D$9:$D$1048576,$B198,'Mobile-Data'!$E$9:$E$1048576,'Mobile-Detail Calcs'!C$167,'Mobile-Data'!$G$9:$G$1048576,'Mobile-Detail Calcs'!C$168,'Mobile-Data'!$C$9:$C$1048576,'Mobile-Detail Calcs'!$C$162)","v":0},{"$f":"SUMIFS('Mobile-Data'!$I$9:$I$1048576,'Mobile-Data'!$D$9:$D$1048576,$B198,'Mobile-Data'!$E$9:$E$1048576,'Mobile-Detail Calcs'!D$167,'Mobile-Data'!$G$9:$G$1048576,'Mobile-Detail Calcs'!D$168,'Mobile-Data'!$C$9:$C$1048576,'Mobile-Detail Calcs'!$C$162)","v":0},{"$f":"SUMIFS('Mobile-Data'!$I$9:$I$1048576,'Mobile-Data'!$D$9:$D$1048576,$B198,'Mobile-Data'!$E$9:$E$1048576,'Mobile-Detail Calcs'!E$167,'Mobile-Data'!$G$9:$G$1048576,'Mobile-Detail Calcs'!E$168,'Mobile-Data'!$C$9:$C$1048576,'Mobile-Detail Calcs'!$C$162)","v":0},{"$f":"SUMIFS('Mobile-Data'!$I$9:$I$1048576,'Mobile-Data'!$D$9:$D$1048576,$B198,'Mobile-Data'!$E$9:$E$1048576,'Mobile-Detail Calcs'!F$167,'Mobile-Data'!$G$9:$G$1048576,'Mobile-Detail Calcs'!F$168,'Mobile-Data'!$C$9:$C$1048576,'Mobile-Detail Calcs'!$C$162)","v":0},{"$f":"SUMIFS('Mobile-Data'!$I$9:$I$1048576,'Mobile-Data'!$D$9:$D$1048576,$B198,'Mobile-Data'!$E$9:$E$1048576,'Mobile-Detail Calcs'!G$167,'Mobile-Data'!$G$9:$G$1048576,'Mobile-Detail Calcs'!G$168,'Mobile-Data'!$C$9:$C$1048576,'Mobile-Detail Calcs'!$C$162)","v":0},{"$f":"SUMIFS('Mobile-Data'!$I$9:$I$1048576,'Mobile-Data'!$D$9:$D$1048576,$B198,'Mobile-Data'!$E$9:$E$1048576,'Mobile-Detail Calcs'!H$167,'Mobile-Data'!$G$9:$G$1048576,'Mobile-Detail Calcs'!H$168,'Mobile-Data'!$C$9:$C$1048576,'Mobile-Detail Calcs'!$C$162)","v":0},0,null,2009,{"$f":"C198*Factors!C207*g_kg*kg_mt*GWP_CH4","v":0},{"$f":"D198*Factors!D207*g_kg*kg_mt*GWP_CH4","v":0},{"$f":"E198*Factors!E207*g_kg*kg_mt*GWP_CH4","v":0},{"$f":"F198*Factors!F207*g_kg*kg_mt*GWP_CH4","v":0},{"$f":"G198*Factors!G207*g_kg*kg_mt*GWP_CH4","v":0},{"$f":"H198*Factors!H207*g_kg*kg_mt*GWP_CH4","v":0},0,null,2009,{"$f":"C198*Factors!K207*g_kg*kg_mt*GWP_N2O","v":0},{"$f":"D198*Factors!L207*g_kg*kg_mt*GWP_N2O","v":0},{"$f":"E198*Factors!M207*g_kg*kg_mt*GWP_N2O","v":0},{"$f":"F198*Factors!N207*g_kg*kg_mt*GWP_N2O","v":0},{"$f":"G198*Factors!O207*g_kg*kg_mt*GWP_N2O","v":0},{"$f":"H198*Factors!P207*g_kg*kg_mt*GWP_N2O","v":0},0]
[null,2010,{"$f":"SUMIFS('Mobile-Data'!$I$9:$I$1048576,'Mobile-Data'!$D$9:$D$1048576,$B199,'Mobile-Data'!$E$9:$E$1048576,'Mobile-Detail Calcs'!C$167,'Mobile-Data'!$G$9:$G$1048576,'Mobile-Detail Calcs'!C$168,'Mobile-Data'!$C$9:$C$1048576,'Mobile-Detail Calcs'!$C$162)","v":0},{"$f":"SUMIFS('Mobile-Data'!$I$9:$I$1048576,'Mobile-Data'!$D$9:$D$1048576,$B199,'Mobile-Data'!$E$9:$E$1048576,'Mobile-Detail Calcs'!D$167,'Mobile-Data'!$G$9:$G$1048576,'Mobile-Detail Calcs'!D$168,'Mobile-Data'!$C$9:$C$1048576,'Mobile-Detail Calcs'!$C$162)","v":0},{"$f":"SUMIFS('Mobile-Data'!$I$9:$I$1048576,'Mobile-Data'!$D$9:$D$1048576,$B199,'Mobile-Data'!$E$9:$E$1048576,'Mobile-Detail Calcs'!E$167,'Mobile-Data'!$G$9:$G$1048576,'Mobile-Detail Calcs'!E$168,'Mobile-Data'!$C$9:$C$1048576,'Mobile-Detail Calcs'!$C$162)","v":0},{"$f":"SUMIFS('Mobile-Data'!$I$9:$I$1048576,'Mobile-Data'!$D$9:$D$1048576,$B199,'Mobile-Data'!$E$9:$E$1048576,'Mobile-Detail Calcs'!F$167,'Mobile-Data'!$G$9:$G$1048576,'Mobile-Detail Calcs'!F$168,'Mobile-Data'!$C$9:$C$1048576,'Mobile-Detail Calcs'!$C$162)","v":0},{"$f":"SUMIFS('Mobile-Data'!$I$9:$I$1048576,'Mobile-Data'!$D$9:$D$1048576,$B199,'Mobile-Data'!$E$9:$E$1048576,'Mobile-Detail Calcs'!G$167,'Mobile-Data'!$G$9:$G$1048576,'Mobile-Detail Calcs'!G$168,'Mobile-Data'!$C$9:$C$1048576,'Mobile-Detail Calcs'!$C$162)","v":0},{"$f":"SUMIFS('Mobile-Data'!$I$9:$I$1048576,'Mobile-Data'!$D$9:$D$1048576,$B199,'Mobile-Data'!$E$9:$E$1048576,'Mobile-Detail Calcs'!H$167,'Mobile-Data'!$G$9:$G$1048576,'Mobile-Detail Calcs'!H$168,'Mobile-Data'!$C$9:$C$1048576,'Mobile-Detail Calcs'!$C$162)","v":0},0,null,2010,{"$f":"C199*Factors!C208*g_kg*kg_mt*GWP_CH4","v":0},{"$f":"D199*Factors!D208*g_kg*kg_mt*GWP_CH4","v":0},{"$f":"E199*Factors!E208*g_kg*kg_mt*GWP_CH4","v":0},{"$f":"F199*Factors!F208*g_kg*kg_mt*GWP_CH4","v":0},{"$f":"G199*Factors!G208*g_kg*kg_mt*GWP_CH4","v":0},{"$f":"H199*Factors!H208*g_kg*kg_mt*GWP_CH4","v":0},0,null,2010,{"$f":"C199*Factors!K208*g_kg*kg_mt*GWP_N2O","v":0},{"$f":"D199*Factors!L208*g_kg*kg_mt*GWP_N2O","v":0},{"$f":"E199*Factors!M208*g_kg*kg_mt*GWP_N2O","v":0},{"$f":"F199*Factors!N208*g_kg*kg_mt*GWP_N2O","v":0},{"$f":"G199*Factors!O208*g_kg*kg_mt*GWP_N2O","v":0},{"$f":"H199*Factors!P208*g_kg*kg_mt*GWP_N2O","v":0},0]
[null,2011,{"$f":"SUMIFS('Mobile-Data'!$I$9:$I$1048576,'Mobile-Data'!$D$9:$D$1048576,$B200,'Mobile-Data'!$E$9:$E$1048576,'Mobile-Detail Calcs'!C$167,'Mobile-Data'!$G$9:$G$1048576,'Mobile-Detail Calcs'!C$168,'Mobile-Data'!$C$9:$C$1048576,'Mobile-Detail Calcs'!$C$162)","v":0},{"$f":"SUMIFS('Mobile-Data'!$I$9:$I$1048576,'Mobile-Data'!$D$9:$D$1048576,$B200,'Mobile-Data'!$E$9:$E$1048576,'Mobile-Detail Calcs'!D$167,'Mobile-Data'!$G$9:$G$1048576,'Mobile-Detail Calcs'!D$168,'Mobile-Data'!$C$9:$C$1048576,'Mobile-Detail Calcs'!$C$162)","v":0},{"$f":"SUMIFS('Mobile-Data'!$I$9:$I$1048576,'Mobile-Data'!$D$9:$D$1048576,$B200,'Mobile-Data'!$E$9:$E$1048576,'Mobile-Detail Calcs'!E$167,'Mobile-Data'!$G$9:$G$1048576,'Mobile-Detail Calcs'!E$168,'Mobile-Data'!$C$9:$C$1048576,'Mobile-Detail Calcs'!$C$162)","v":0},{"$f":"SUMIFS('Mobile-Data'!$I$9:$I$1048576,'Mobile-Data'!$D$9:$D$1048576,$B200,'Mobile-Data'!$E$9:$E$1048576,'Mobile-Detail Calcs'!F$167,'Mobile-Data'!$G$9:$G$1048576,'Mobile-Detail Calcs'!F$168,'Mobile-Data'!$C$9:$C$1048576,'Mobile-Detail Calcs'!$C$162)","v":0},{"$f":"SUMIFS('Mobile-Data'!$I$9:$I$1048576,'Mobile-Data'!$D$9:$D$1048576,$B200,'Mobile-Data'!$E$9:$E$1048576,'Mobile-Detail Calcs'!G$167,'Mobile-Data'!$G$9:$G$1048576,'Mobile-Detail Calcs'!G$168,'Mobile-Data'!$C$9:$C$1048576,'Mobile-Detail Calcs'!$C$162)","v":0},{"$f":"SUMIFS('Mobile-Data'!$I$9:$I$1048576,'Mobile-Data'!$D$9:$D$1048576,$B200,'Mobile-Data'!$E$9:$E$1048576,'Mobile-Detail Calcs'!H$167,'Mobile-Data'!$G$9:$G$1048576,'Mobile-Detail Calcs'!H$168,'Mobile-Data'!$C$9:$C$1048576,'Mobile-Detail Calcs'!$C$162)","v":0},0,null,2011,{"$f":"C200*Factors!C209*g_kg*kg_mt*GWP_CH4","v":0},{"$f":"D200*Factors!D209*g_kg*kg_mt*GWP_CH4","v":0},{"$f":"E200*Factors!E209*g_kg*kg_mt*GWP_CH4","v":0},{"$f":"F200*Factors!F209*g_kg*kg_mt*GWP_CH4","v":0},{"$f":"G200*Factors!G209*g_kg*kg_mt*GWP_CH4","v":0},{"$f":"H200*Factors!H209*g_kg*kg_mt*GWP_CH4","v":0},0,null,2011,{"$f":"C200*Factors!K209*g_kg*kg_mt*GWP_N2O","v":0},{"$f":"D200*Factors!L209*g_kg*kg_mt*GWP_N2O","v":0},{"$f":"E200*Factors!M209*g_kg*kg_mt*GWP_N2O","v":0},{"$f":"F200*Factors!N209*g_kg*kg_mt*GWP_N2O","v":0},{"$f":"G200*Factors!O209*g_kg*kg_mt*GWP_N2O","v":0},{"$f":"H200*Factors!P209*g_kg*kg_mt*GWP_N2O","v":0},0]
[null,2012,{"$f":"SUMIFS('Mobile-Data'!$I$9:$I$1048576,'Mobile-Data'!$D$9:$D$1048576,$B201,'Mobile-Data'!$E$9:$E$1048576,'Mobile-Detail Calcs'!C$167,'Mobile-Data'!$G$9:$G$1048576,'Mobile-Detail Calcs'!C$168,'Mobile-Data'!$C$9:$C$1048576,'Mobile-Detail Calcs'!$C$162)","v":0},{"$f":"SUMIFS('Mobile-Data'!$I$9:$I$1048576,'Mobile-Data'!$D$9:$D$1048576,$B201,'Mobile-Data'!$E$9:$E$1048576,'Mobile-Detail Calcs'!D$167,'Mobile-Data'!$G$9:$G$1048576,'Mobile-Detail Calcs'!D$168,'Mobile-Data'!$C$9:$C$1048576,'Mobile-Detail Calcs'!$C$162)","v":0},{"$f":"SUMIFS('Mobile-Data'!$I$9:$I$1048576,'Mobile-Data'!$D$9:$D$1048576,$B201,'Mobile-Data'!$E$9:$E$1048576,'Mobile-Detail Calcs'!E$167,'Mobile-Data'!$G$9:$G$1048576,'Mobile-Detail Calcs'!E$168,'Mobile-Data'!$C$9:$C$1048576,'Mobile-Detail Calcs'!$C$162)","v":0},{"$f":"SUMIFS('Mobile-Data'!$I$9:$I$1048576,'Mobile-Data'!$D$9:$D$1048576,$B201,'Mobile-Data'!$E$9:$E$1048576,'Mobile-Detail Calcs'!F$167,'Mobile-Data'!$G$9:$G$1048576,'Mobile-Detail Calcs'!F$168,'Mobile-Data'!$C$9:$C$1048576,'Mobile-Detail Calcs'!$C$162)","v":0},{"$f":"SUMIFS('Mobile-Data'!$I$9:$I$1048576,'Mobile-Data'!$D$9:$D$1048576,$B201,'Mobile-Data'!$E$9:$E$1048576,'Mobile-Detail Calcs'!G$167,'Mobile-Data'!$G$9:$G$1048576,'Mobile-Detail Calcs'!G$168,'Mobile-Data'!$C$9:$C$1048576,'Mobile-Detail Calcs'!$C$162)","v":0},{"$f":"SUMIFS('Mobile-Data'!$I$9:$I$1048576,'Mobile-Data'!$D$9:$D$1048576,$B201,'Mobile-Data'!$E$9:$E$1048576,'Mobile-Detail Calcs'!H$167,'Mobile-Data'!$G$9:$G$1048576,'Mobile-Detail Calcs'!H$168,'Mobile-Data'!$C$9:$C$1048576,'Mobile-Detail Calcs'!$C$162)","v":0},0,null,2012,{"$f":"C201*Factors!C210*g_kg*kg_mt*GWP_CH4","v":0},{"$f":"D201*Factors!D210*g_kg*kg_mt*GWP_CH4","v":0},{"$f":"E201*Factors!E210*g_kg*kg_mt*GWP_CH4","v":0},{"$f":"F201*Factors!F210*g_kg*kg_mt*GWP_CH4","v":0},{"$f":"G201*Factors!G210*g_kg*kg_mt*GWP_CH4","v":0},{"$f":"H201*Factors!H210*g_kg*kg_mt*GWP_CH4","v":0},0,null,2012,{"$f":"C201*Factors!K210*g_kg*kg_mt*GWP_N2O","v":0},{"$f":"D201*Factors!L210*g_kg*kg_mt*GWP_N2O","v":0},{"$f":"E201*Factors!M210*g_kg*kg_mt*GWP_N2O","v":0},{"$f":"F201*Factors!N210*g_kg*kg_mt*GWP_N2O","v":0},{"$f":"G201*Factors!O210*g_kg*kg_mt*GWP_N2O","v":0},{"$f":"H201*Factors!P210*g_kg*kg_mt*GWP_N2O","v":0},0]
[null,2013,{"$f":"SUMIFS('Mobile-Data'!$I$9:$I$1048576,'Mobile-Data'!$D$9:$D$1048576,$B202,'Mobile-Data'!$E$9:$E$1048576,'Mobile-Detail Calcs'!C$167,'Mobile-Data'!$G$9:$G$1048576,'Mobile-Detail Calcs'!C$168,'Mobile-Data'!$C$9:$C$1048576,'Mobile-Detail Calcs'!$C$162)","v":0},{"$f":"SUMIFS('Mobile-Data'!$I$9:$I$1048576,'Mobile-Data'!$D$9:$D$1048576,$B202,'Mobile-Data'!$E$9:$E$1048576,'Mobile-Detail Calcs'!D$167,'Mobile-Data'!$G$9:$G$1048576,'Mobile-Detail Calcs'!D$168,'Mobile-Data'!$C$9:$C$1048576,'Mobile-Detail Calcs'!$C$162)","v":0},{"$f":"SUMIFS('Mobile-Data'!$I$9:$I$1048576,'Mobile-Data'!$D$9:$D$1048576,$B202,'Mobile-Data'!$E$9:$E$1048576,'Mobile-Detail Calcs'!E$167,'Mobile-Data'!$G$9:$G$1048576,'Mobile-Detail Calcs'!E$168,'Mobile-Data'!$C$9:$C$1048576,'Mobile-Detail Calcs'!$C$162)","v":0},{"$f":"SUMIFS('Mobile-Data'!$I$9:$I$1048576,'Mobile-Data'!$D$9:$D$1048576,$B202,'Mobile-Data'!$E$9:$E$1048576,'Mobile-Detail Calcs'!F$167,'Mobile-Data'!$G$9:$G$1048576,'Mobile-Detail Calcs'!F$168,'Mobile-Data'!$C$9:$C$1048576,'Mobile-Detail Calcs'!$C$162)","v":0},{"$f":"SUMIFS('Mobile-Data'!$I$9:$I$1048576,'Mobile-Data'!$D$9:$D$1048576,$B202,'Mobile-Data'!$E$9:$E$1048576,'Mobile-Detail Calcs'!G$167,'Mobile-Data'!$G$9:$G$1048576,'Mobile-Detail Calcs'!G$168,'Mobile-Data'!$C$9:$C$1048576,'Mobile-Detail Calcs'!$C$162)","v":0},{"$f":"SUMIFS('Mobile-Data'!$I$9:$I$1048576,'Mobile-Data'!$D$9:$D$1048576,$B202,'Mobile-Data'!$E$9:$E$1048576,'Mobile-Detail Calcs'!H$167,'Mobile-Data'!$G$9:$G$1048576,'Mobile-Detail Calcs'!H$168,'Mobile-Data'!$C$9:$C$1048576,'Mobile-Detail Calcs'!$C$162)","v":0},{"$f":"SUM(C202:H202)","v":0},null,2013,{"$f":"C202*Factors!C211*g_kg*kg_mt*GWP_CH4","v":0},{"$f":"D202*Factors!D211*g_kg*kg_mt*GWP_CH4","v":0},{"$f":"E202*Factors!E211*g_kg*kg_mt*GWP_CH4","v":0},{"$f":"F202*Factors!F211*g_kg*kg_mt*GWP_CH4","v":0},{"$f":"G202*Factors!G211*g_kg*kg_mt*GWP_CH4","v":0},{"$f":"H202*Factors!H211*g_kg*kg_mt*GWP_CH4","v":0},{"$f":"SUM(L202:Q202)","v":0},null,2013,{"$f":"C202*Factors!K211*g_kg*kg_mt*GWP_N2O","v":0},{"$f":"D202*Factors!L211*g_kg*kg_mt*GWP_N2O","v":0},{"$f":"E202*Factors!M211*g_kg*kg_mt*GWP_N2O","v":0},{"$f":"F202*Factors!N211*g_kg*kg_mt*GWP_N2O","v":0},{"$f":"G202*Factors!O211*g_kg*kg_mt*GWP_N2O","v":0},{"$f":"H202*Factors!P211*g_kg*kg_mt*GWP_N2O","v":0},{"$f":"SUM(U202:Z202)","v":0}]
[null,2014,{"$f":"SUMIFS('Mobile-Data'!$I$9:$I$1048576,'Mobile-Data'!$D$9:$D$1048576,$B203,'Mobile-Data'!$E$9:$E$1048576,'Mobile-Detail Calcs'!C$167,'Mobile-Data'!$G$9:$G$1048576,'Mobile-Detail Calcs'!C$168,'Mobile-Data'!$C$9:$C$1048576,'Mobile-Detail Calcs'!$C$162)","v":0},{"$f":"SUMIFS('Mobile-Data'!$I$9:$I$1048576,'Mobile-Data'!$D$9:$D$1048576,$B203,'Mobile-Data'!$E$9:$E$1048576,'Mobile-Detail Calcs'!D$167,'Mobile-Data'!$G$9:$G$1048576,'Mobile-Detail Calcs'!D$168,'Mobile-Data'!$C$9:$C$1048576,'Mobile-Detail Calcs'!$C$162)","v":0},{"$f":"SUMIFS('Mobile-Data'!$I$9:$I$1048576,'Mobile-Data'!$D$9:$D$1048576,$B203,'Mobile-Data'!$E$9:$E$1048576,'Mobile-Detail Calcs'!E$167,'Mobile-Data'!$G$9:$G$1048576,'Mobile-Detail Calcs'!E$168,'Mobile-Data'!$C$9:$C$1048576,'Mobile-Detail Calcs'!$C$162)","v":0},{"$f":"SUMIFS('Mobile-Data'!$I$9:$I$1048576,'Mobile-Data'!$D$9:$D$1048576,$B203,'Mobile-Data'!$E$9:$E$1048576,'Mobile-Detail Calcs'!F$167,'Mobile-Data'!$G$9:$G$1048576,'Mobile-Detail Calcs'!F$168,'Mobile-Data'!$C$9:$C$1048576,'Mobile-Detail Calcs'!$C$162)","v":0},{"$f":"SUMIFS('Mobile-Data'!$I$9:$I$1048576,'Mobile-Data'!$D$9:$D$1048576,$B203,'Mobile-Data'!$E$9:$E$1048576,'Mobile-Detail Calcs'!G$167,'Mobile-Data'!$G$9:$G$1048576,'Mobile-Detail Calcs'!G$168,'Mobile-Data'!$C$9:$C$1048576,'Mobile-Detail Calcs'!$C$162)","v":0},{"$f":"SUMIFS('Mobile-Data'!$I$9:$I$1048576,'Mobile-Data'!$D$9:$D$1048576,$B203,'Mobile-Data'!$E$9:$E$1048576,'Mobile-Detail Calcs'!H$167,'Mobile-Data'!$G$9:$G$1048576,'Mobile-Detail Calcs'!H$168,'Mobile-Data'!$C$9:$C$1048576,'Mobile-Detail Calcs'!$C$162)","v":0},0,null,2014,{"$f":"C203*Factors!C212*g_kg*kg_mt*GWP_CH4","v":0},{"$f":"D203*Factors!D212*g_kg*kg_mt*GWP_CH4","v":0},{"$f":"E203*Factors!E212*g_kg*kg_mt*GWP_CH4","v":0},{"$f":"F203*Factors!F212*g_kg*kg_mt*GWP_CH4","v":0},{"$f":"G203*Factors!G212*g_kg*kg_mt*GWP_CH4","v":0},{"$f":"H203*Factors!H212*g_kg*kg_mt*GWP_CH4","v":0},0,null,2014,{"$f":"C203*Factors!K212*g_kg*kg_mt*GWP_N2O","v":0},{"$f":"D203*Factors!L212*g_kg*kg_mt*GWP_N2O","v":0},{"$f":"E203*Factors!M212*g_kg*kg_mt*GWP_N2O","v":0},{"$f":"F203*Factors!N212*g_kg*kg_mt*GWP_N2O","v":0},{"$f":"G203*Factors!O212*g_kg*kg_mt*GWP_N2O","v":0},{"$f":"H203*Factors!P212*g_kg*kg_mt*GWP_N2O","v":0},0]
[null,2015,{"$f":"SUMIFS('Mobile-Data'!$I$9:$I$1048576,'Mobile-Data'!$D$9:$D$1048576,$B204,'Mobile-Data'!$E$9:$E$1048576,'Mobile-Detail Calcs'!C$167,'Mobile-Data'!$G$9:$G$1048576,'Mobile-Detail Calcs'!C$168,'Mobile-Data'!$C$9:$C$1048576,'Mobile-Detail Calcs'!$C$162)","v":0},{"$f":"SUMIFS('Mobile-Data'!$I$9:$I$1048576,'Mobile-Data'!$D$9:$D$1048576,$B204,'Mobile-Data'!$E$9:$E$1048576,'Mobile-Detail Calcs'!D$167,'Mobile-Data'!$G$9:$G$1048576,'Mobile-Detail Calcs'!D$168,'Mobile-Data'!$C$9:$C$1048576,'Mobile-Detail Calcs'!$C$162)","v":0},{"$f":"SUMIFS('Mobile-Data'!$I$9:$I$1048576,'Mobile-Data'!$D$9:$D$1048576,$B204,'Mobile-Data'!$E$9:$E$1048576,'Mobile-Detail Calcs'!E$167,'Mobile-Data'!$G$9:$G$1048576,'Mobile-Detail Calcs'!E$168,'Mobile-Data'!$C$9:$C$1048576,'Mobile-Detail Calcs'!$C$162)","v":0},{"$f":"SUMIFS('Mobile-Data'!$I$9:$I$1048576,'Mobile-Data'!$D$9:$D$1048576,$B204,'Mobile-Data'!$E$9:$E$1048576,'Mobile-Detail Calcs'!F$167,'Mobile-Data'!$G$9:$G$1048576,'Mobile-Detail Calcs'!F$168,'Mobile-Data'!$C$9:$C$1048576,'Mobile-Detail Calcs'!$C$162)","v":0},{"$f":"SUMIFS('Mobile-Data'!$I$9:$I$1048576,'Mobile-Data'!$D$9:$D$1048576,$B204,'Mobile-Data'!$E$9:$E$1048576,'Mobile-Detail Calcs'!G$167,'Mobile-Data'!$G$9:$G$1048576,'Mobile-Detail Calcs'!G$168,'Mobile-Data'!$C$9:$C$1048576,'Mobile-Detail Calcs'!$C$162)","v":0},{"$f":"SUMIFS('Mobile-Data'!$I$9:$I$1048576,'Mobile-Data'!$D$9:$D$1048576,$B204,'Mobile-Data'!$E$9:$E$1048576,'Mobile-Detail Calcs'!H$167,'Mobile-Data'!$G$9:$G$1048576,'Mobile-Detail Calcs'!H$168,'Mobile-Data'!$C$9:$C$1048576,'Mobile-Detail Calcs'!$C$162)","v":0},0,null,2015,{"$f":"C204*Factors!C213*g_kg*kg_mt*GWP_CH4","v":0},{"$f":"D204*Factors!D213*g_kg*kg_mt*GWP_CH4","v":0},{"$f":"E204*Factors!E213*g_kg*kg_mt*GWP_CH4","v":0},{"$f":"F204*Factors!F213*g_kg*kg_mt*GWP_CH4","v":0},{"$f":"G204*Factors!G213*g_kg*kg_mt*GWP_CH4","v":0},{"$f":"H204*Factors!H213*g_kg*kg_mt*GWP_CH4","v":0},0,null,2015,{"$f":"C204*Factors!K213*g_kg*kg_mt*GWP_N2O","v":0},{"$f":"D204*Factors!L213*g_kg*kg_mt*GWP_N2O","v":0},{"$f":"E204*Factors!M213*g_kg*kg_mt*GWP_N2O","v":0},{"$f":"F204*Factors!N213*g_kg*kg_mt*GWP_N2O","v":0},{"$f":"G204*Factors!O213*g_kg*kg_mt*GWP_N2O","v":0},{"$f":"H204*Factors!P213*g_kg*kg_mt*GWP_N2O","v":0},0]
[null,2016,{"$f":"SUMIFS('Mobile-Data'!$I$9:$I$1048576,'Mobile-Data'!$D$9:$D$1048576,$B205,'Mobile-Data'!$E$9:$E$1048576,'Mobile-Detail Calcs'!C$167,'Mobile-Data'!$G$9:$G$1048576,'Mobile-Detail Calcs'!C$168,'Mobile-Data'!$C$9:$C$1048576,'Mobile-Detail Calcs'!$C$162)","v":0},{"$f":"SUMIFS('Mobile-Data'!$I$9:$I$1048576,'Mobile-Data'!$D$9:$D$1048576,$B205,'Mobile-Data'!$E$9:$E$1048576,'Mobile-Detail Calcs'!D$167,'Mobile-Data'!$G$9:$G$1048576,'Mobile-Detail Calcs'!D$168,'Mobile-Data'!$C$9:$C$1048576,'Mobile-Detail Calcs'!$C$162)","v":0},{"$f":"SUMIFS('Mobile-Data'!$I$9:$I$1048576,'Mobile-Data'!$D$9:$D$1048576,$B205,'Mobile-Data'!$E$9:$E$1048576,'Mobile-Detail Calcs'!E$167,'Mobile-Data'!$G$9:$G$1048576,'Mobile-Detail Calcs'!E$168,'Mobile-Data'!$C$9:$C$1048576,'Mobile-Detail Calcs'!$C$162)","v":0},{"$f":"SUMIFS('Mobile-Data'!$I$9:$I$1048576,'Mobile-Data'!$D$9:$D$1048576,$B205,'Mobile-Data'!$E$9:$E$1048576,'Mobile-Detail Calcs'!F$167,'Mobile-Data'!$G$9:$G$1048576,'Mobile-Detail Calcs'!F$168,'Mobile-Data'!$C$9:$C$1048576,'Mobile-Detail Calcs'!$C$162)","v":0},{"$f":"SUMIFS('Mobile-Data'!$I$9:$I$1048576,'Mobile-Data'!$D$9:$D$1048576,$B205,'Mobile-Data'!$E$9:$E$1048576,'Mobile-Detail Calcs'!G$167,'Mobile-Data'!$G$9:$G$1048576,'Mobile-Detail Calcs'!G$168,'Mobile-Data'!$C$9:$C$1048576,'Mobile-Detail Calcs'!$C$162)","v":0},{"$f":"SUMIFS('Mobile-Data'!$I$9:$I$1048576,'Mobile-Data'!$D$9:$D$1048576,$B205,'Mobile-Data'!$E$9:$E$1048576,'Mobile-Detail Calcs'!H$167,'Mobile-Data'!$G$9:$G$1048576,'Mobile-Detail Calcs'!H$168,'Mobile-Data'!$C$9:$C$1048576,'Mobile-Detail Calcs'!$C$162)","v":0},0,null,2016,{"$f":"C205*Factors!C214*g_kg*kg_mt*GWP_CH4","v":0},{"$f":"D205*Factors!D214*g_kg*kg_mt*GWP_CH4","v":0},{"$f":"E205*Factors!E214*g_kg*kg_mt*GWP_CH4","v":0},{"$f":"F205*Factors!F214*g_kg*kg_mt*GWP_CH4","v":0},{"$f":"G205*Factors!G214*g_kg*kg_mt*GWP_CH4","v":0},{"$f":"H205*Factors!H214*g_kg*kg_mt*GWP_CH4","v":0},0,null,2016,{"$f":"C205*Factors!K214*g_kg*kg_mt*GWP_N2O","v":0},{"$f":"D205*Factors!L214*g_kg*kg_mt*GWP_N2O","v":0},{"$f":"E205*Factors!M214*g_kg*kg_mt*GWP_N2O","v":0},{"$f":"F205*Factors!N214*g_kg*kg_mt*GWP_N2O","v":0},{"$f":"G205*Factors!O214*g_kg*kg_mt*GWP_N2O","v":0},{"$f":"H205*Factors!P214*g_kg*kg_mt*GWP_N2O","v":0},0]
[null,2017,{"$f":"SUMIFS('Mobile-Data'!$I$9:$I$1048576,'Mobile-Data'!$D$9:$D$1048576,$B206,'Mobile-Data'!$E$9:$E$1048576,'Mobile-Detail Calcs'!C$167,'Mobile-Data'!$G$9:$G$1048576,'Mobile-Detail Calcs'!C$168,'Mobile-Data'!$C$9:$C$1048576,'Mobile-Detail Calcs'!$C$162)","v":0},{"$f":"SUMIFS('Mobile-Data'!$I$9:$I$1048576,'Mobile-Data'!$D$9:$D$1048576,$B206,'Mobile-Data'!$E$9:$E$1048576,'Mobile-Detail Calcs'!D$167,'Mobile-Data'!$G$9:$G$1048576,'Mobile-Detail Calcs'!D$168,'Mobile-Data'!$C$9:$C$1048576,'Mobile-Detail Calcs'!$C$162)","v":0},{"$f":"SUMIFS('Mobile-Data'!$I$9:$I$1048576,'Mobile-Data'!$D$9:$D$1048576,$B206,'Mobile-Data'!$E$9:$E$1048576,'Mobile-Detail Calcs'!E$167,'Mobile-Data'!$G$9:$G$1048576,'Mobile-Detail Calcs'!E$168,'Mobile-Data'!$C$9:$C$1048576,'Mobile-Detail Calcs'!$C$162)","v":0},{"$f":"SUMIFS('Mobile-Data'!$I$9:$I$1048576,'Mobile-Data'!$D$9:$D$1048576,$B206,'Mobile-Data'!$E$9:$E$1048576,'Mobile-Detail Calcs'!F$167,'Mobile-Data'!$G$9:$G$1048576,'Mobile-Detail Calcs'!F$168,'Mobile-Data'!$C$9:$C$1048576,'Mobile-Detail Calcs'!$C$162)","v":0},{"$f":"SUMIFS('Mobile-Data'!$I$9:$I$1048576,'Mobile-Data'!$D$9:$D$1048576,$B206,'Mobile-Data'!$E$9:$E$1048576,'Mobile-Detail Calcs'!G$167,'Mobile-Data'!$G$9:$G$1048576,'Mobile-Detail Calcs'!G$168,'Mobile-Data'!$C$9:$C$1048576,'Mobile-Detail Calcs'!$C$162)","v":0},{"$f":"SUMIFS('Mobile-Data'!$I$9:$I$1048576,'Mobile-Data'!$D$9:$D$1048576,$B206,'Mobile-Data'!$E$9:$E$1048576,'Mobile-Detail Calcs'!H$167,'Mobile-Data'!$G$9:$G$1048576,'Mobile-Detail Calcs'!H$168,'Mobile-Data'!$C$9:$C$1048576,'Mobile-Detail Calcs'!$C$162)","v":0},0,null,2017,{"$f":"C206*Factors!C215*g_kg*kg_mt*GWP_CH4","v":0},{"$f":"D206*Factors!D215*g_kg*kg_mt*GWP_CH4","v":0},{"$f":"E206*Factors!E215*g_kg*kg_mt*GWP_CH4","v":0},{"$f":"F206*Factors!F215*g_kg*kg_mt*GWP_CH4","v":0},{"$f":"G206*Factors!G215*g_kg*kg_mt*GWP_CH4","v":0},{"$f":"H206*Factors!H215*g_kg*kg_mt*GWP_CH4","v":0},0,null,2017,{"$f":"C206*Factors!K215*g_kg*kg_mt*GWP_N2O","v":0},{"$f":"D206*Factors!L215*g_kg*kg_mt*GWP_N2O","v":0},{"$f":"E206*Factors!M215*g_kg*kg_mt*GWP_N2O","v":0},{"$f":"F206*Factors!N215*g_kg*kg_mt*GWP_N2O","v":0},{"$f":"G206*Factors!O215*g_kg*kg_mt*GWP_N2O","v":0},{"$f":"H206*Factors!P215*g_kg*kg_mt*GWP_N2O","v":0},0]
[null,2018,{"$f":"SUMIFS('Mobile-Data'!$I$9:$I$1048576,'Mobile-Data'!$D$9:$D$1048576,$B207,'Mobile-Data'!$E$9:$E$1048576,'Mobile-Detail Calcs'!C$167,'Mobile-Data'!$G$9:$G$1048576,'Mobile-Detail Calcs'!C$168,'Mobile-Data'!$C$9:$C$1048576,'Mobile-Detail Calcs'!$C$162)","v":0},{"$f":"SUMIFS('Mobile-Data'!$I$9:$I$1048576,'Mobile-Data'!$D$9:$D$1048576,$B207,'Mobile-Data'!$E$9:$E$1048576,'Mobile-Detail Calcs'!D$167,'Mobile-Data'!$G$9:$G$1048576,'Mobile-Detail Calcs'!D$168,'Mobile-Data'!$C$9:$C$1048576,'Mobile-Detail Calcs'!$C$162)","v":0},{"$f":"SUMIFS('Mobile-Data'!$I$9:$I$1048576,'Mobile-Data'!$D$9:$D$1048576,$B207,'Mobile-Data'!$E$9:$E$1048576,'Mobile-Detail Calcs'!E$167,'Mobile-Data'!$G$9:$G$1048576,'Mobile-Detail Calcs'!E$168,'Mobile-Data'!$C$9:$C$1048576,'Mobile-Detail Calcs'!$C$162)","v":0},{"$f":"SUMIFS('Mobile-Data'!$I$9:$I$1048576,'Mobile-Data'!$D$9:$D$1048576,$B207,'Mobile-Data'!$E$9:$E$1048576,'Mobile-Detail Calcs'!F$167,'Mobile-Data'!$G$9:$G$1048576,'Mobile-Detail Calcs'!F$168,'Mobile-Data'!$C$9:$C$1048576,'Mobile-Detail Calcs'!$C$162)","v":0},{"$f":"SUMIFS('Mobile-Data'!$I$9:$I$1048576,'Mobile-Data'!$D$9:$D$1048576,$B207,'Mobile-Data'!$E$9:$E$1048576,'Mobile-Detail Calcs'!G$167,'Mobile-Data'!$G$9:$G$1048576,'Mobile-Detail Calcs'!G$168,'Mobile-Data'!$C$9:$C$1048576,'Mobile-Detail Calcs'!$C$162)","v":0},{"$f":"SUMIFS('Mobile-Data'!$I$9:$I$1048576,'Mobile-Data'!$D$9:$D$1048576,$B207,'Mobile-Data'!$E$9:$E$1048576,'Mobile-Detail Calcs'!H$167,'Mobile-Data'!$G$9:$G$1048576,'Mobile-Detail Calcs'!H$168,'Mobile-Data'!$C$9:$C$1048576,'Mobile-Detail Calcs'!$C$162)","v":0},0,null,2018,{"$f":"C207*Factors!C216*g_kg*kg_mt*GWP_CH4","v":0},{"$f":"D207*Factors!D216*g_kg*kg_mt*GWP_CH4","v":0},{"$f":"E207*Factors!E216*g_kg*kg_mt*GWP_CH4","v":0},{"$f":"F207*Factors!F216*g_kg*kg_mt*GWP_CH4","v":0},{"$f":"G207*Factors!G216*g_kg*kg_mt*GWP_CH4","v":0},{"$f":"H207*Factors!H216*g_kg*kg_mt*GWP_CH4","v":0},0,null,2018,{"$f":"C207*Factors!K216*g_kg*kg_mt*GWP_N2O","v":0},{"$f":"D207*Factors!L216*g_kg*kg_mt*GWP_N2O","v":0},{"$f":"E207*Factors!M216*g_kg*kg_mt*GWP_N2O","v":0},{"$f":"F207*Factors!N216*g_kg*kg_mt*GWP_N2O","v":0},{"$f":"G207*Factors!O216*g_kg*kg_mt*GWP_N2O","v":0},{"$f":"H207*Factors!P216*g_kg*kg_mt*GWP_N2O","v":0},0]
[null,2019,{"$f":"SUMIFS('Mobile-Data'!$I$9:$I$1048576,'Mobile-Data'!$D$9:$D$1048576,$B208,'Mobile-Data'!$E$9:$E$1048576,'Mobile-Detail Calcs'!C$167,'Mobile-Data'!$G$9:$G$1048576,'Mobile-Detail Calcs'!C$168,'Mobile-Data'!$C$9:$C$1048576,'Mobile-Detail Calcs'!$C$162)","v":0},{"$f":"SUMIFS('Mobile-Data'!$I$9:$I$1048576,'Mobile-Data'!$D$9:$D$1048576,$B208,'Mobile-Data'!$E$9:$E$1048576,'Mobile-Detail Calcs'!D$167,'Mobile-Data'!$G$9:$G$1048576,'Mobile-Detail Calcs'!D$168,'Mobile-Data'!$C$9:$C$1048576,'Mobile-Detail Calcs'!$C$162)","v":0},{"$f":"SUMIFS('Mobile-Data'!$I$9:$I$1048576,'Mobile-Data'!$D$9:$D$1048576,$B208,'Mobile-Data'!$E$9:$E$1048576,'Mobile-Detail Calcs'!E$167,'Mobile-Data'!$G$9:$G$1048576,'Mobile-Detail Calcs'!E$168,'Mobile-Data'!$C$9:$C$1048576,'Mobile-Detail Calcs'!$C$162)","v":0},{"$f":"SUMIFS('Mobile-Data'!$I$9:$I$1048576,'Mobile-Data'!$D$9:$D$1048576,$B208,'Mobile-Data'!$E$9:$E$1048576,'Mobile-Detail Calcs'!F$167,'Mobile-Data'!$G$9:$G$1048576,'Mobile-Detail Calcs'!F$168,'Mobile-Data'!$C$9:$C$1048576,'Mobile-Detail Calcs'!$C$162)","v":0},{"$f":"SUMIFS('Mobile-Data'!$I$9:$I$1048576,'Mobile-Data'!$D$9:$D$1048576,$B208,'Mobile-Data'!$E$9:$E$1048576,'Mobile-Detail Calcs'!G$167,'Mobile-Data'!$G$9:$G$1048576,'Mobile-Detail Calcs'!G$168,'Mobile-Data'!$C$9:$C$1048576,'Mobile-Detail Calcs'!$C$162)","v":0},{"$f":"SUMIFS('Mobile-Data'!$I$9:$I$1048576,'Mobile-Data'!$D$9:$D$1048576,$B208,'Mobile-Data'!$E$9:$E$1048576,'Mobile-Detail Calcs'!H$167,'Mobile-Data'!$G$9:$G$1048576,'Mobile-Detail Calcs'!H$168,'Mobile-Data'!$C$9:$C$1048576,'Mobile-Detail Calcs'!$C$162)","v":0},0,null,2019,{"$f":"C208*Factors!C217*g_kg*kg_mt*GWP_CH4","v":0},{"$f":"D208*Factors!D217*g_kg*kg_mt*GWP_CH4","v":0},{"$f":"E208*Factors!E217*g_kg*kg_mt*GWP_CH4","v":0},{"$f":"F208*Factors!F217*g_kg*kg_mt*GWP_CH4","v":0},{"$f":"G208*Factors!G217*g_kg*kg_mt*GWP_CH4","v":0},{"$f":"H208*Factors!H217*g_kg*kg_mt*GWP_CH4","v":0},0,null,2019,{"$f":"C208*Factors!K217*g_kg*kg_mt*GWP_N2O","v":0},{"$f":"D208*Factors!L217*g_kg*kg_mt*GWP_N2O","v":0},{"$f":"E208*Factors!M217*g_kg*kg_mt*GWP_N2O","v":0},{"$f":"F208*Factors!N217*g_kg*kg_mt*GWP_N2O","v":0},{"$f":"G208*Factors!O217*g_kg*kg_mt*GWP_N2O","v":0},{"$f":"H208*Factors!P217*g_kg*kg_mt*GWP_N2O","v":0},0]
[null,"2020 & later",{"$f":"SUMIFS('Mobile-Data'!$I$9:$I$1048576,'Mobile-Data'!$D$9:$D$1048576,\"<=2020\",'Mobile-Data'!$E$9:$E$1048576,'Mobile-Detail Calcs'!C$167,'Mobile-Data'!$G$9:$G$1048576,'Mobile-Detail Calcs'!C$168,'Mobile-Data'!$C$9:$C$1048576,'Mobile-Detail Calcs'!$C$162)","v":0},{"$f":"SUMIFS('Mobile-Data'!$I$9:$I$1048576,'Mobile-Data'!$D$9:$D$1048576,\"<=2020\",'Mobile-Data'!$E$9:$E$1048576,'Mobile-Detail Calcs'!D$167,'Mobile-Data'!$G$9:$G$1048576,'Mobile-Detail Calcs'!D$168,'Mobile-Data'!$C$9:$C$1048576,'Mobile-Detail Calcs'!$C$162)","v":0},{"$f":"SUMIFS('Mobile-Data'!$I$9:$I$1048576,'Mobile-Data'!$D$9:$D$1048576,\"<=2020\",'Mobile-Data'!$E$9:$E$1048576,'Mobile-Detail Calcs'!E$167,'Mobile-Data'!$G$9:$G$1048576,'Mobile-Detail Calcs'!E$168,'Mobile-Data'!$C$9:$C$1048576,'Mobile-Detail Calcs'!$C$162)","v":0},{"$f":"SUMIFS('Mobile-Data'!$I$9:$I$1048576,'Mobile-Data'!$D$9:$D$1048576,\"<=2020\",'Mobile-Data'!$E$9:$E$1048576,'Mobile-Detail Calcs'!F$167,'Mobile-Data'!$G$9:$G$1048576,'Mobile-Detail Calcs'!F$168,'Mobile-Data'!$C$9:$C$1048576,'Mobile-Detail Calcs'!$C$162)","v":0},{"$f":"SUMIFS('Mobile-Data'!$I$9:$I$1048576,'Mobile-Data'!$D$9:$D$1048576,\"<=2020\",'Mobile-Data'!$E$9:$E$1048576,'Mobile-Detail Calcs'!G$167,'Mobile-Data'!$G$9:$G$1048576,'Mobile-Detail Calcs'!G$168,'Mobile-Data'!$C$9:$C$1048576,'Mobile-Detail Calcs'!$C$162)","v":0},{"$f":"SUMIFS('Mobile-Data'!$I$9:$I$1048576,'Mobile-Data'!$D$9:$D$1048576,\"<=2020\",'Mobile-Data'!$E$9:$E$1048576,'Mobile-Detail Calcs'!H$167,'Mobile-Data'!$G$9:$G$1048576,'Mobile-Detail Calcs'!H$168,'Mobile-Data'!$C$9:$C$1048576,'Mobile-Detail Calcs'!$C$162)","v":0},0,null,2020,{"$f":"C209*Factors!C218*g_kg*kg_mt*GWP_CH4","v":0},{"$f":"D209*Factors!D218*g_kg*kg_mt*GWP_CH4","v":0},{"$f":"E209*Factors!E218*g_kg*kg_mt*GWP_CH4","v":0},{"$f":"F209*Factors!F218*g_kg*kg_mt*GWP_CH4","v":0},{"$f":"G209*Factors!G218*g_kg*kg_mt*GWP_CH4","v":0},{"$f":"H209*Factors!H218*g_kg*kg_mt*GWP_CH4","v":0},0,null,2020,{"$f":"C209*Factors!K218*g_kg*kg_mt*GWP_N2O","v":0},{"$f":"D209*Factors!L218*g_kg*kg_mt*GWP_N2O","v":0},{"$f":"E209*Factors!M218*g_kg*kg_mt*GWP_N2O","v":0},{"$f":"F209*Factors!N218*g_kg*kg_mt*GWP_N2O","v":0},{"$f":"G209*Factors!O218*g_kg*kg_mt*GWP_N2O","v":0},{"$f":"H209*Factors!P218*g_kg*kg_mt*GWP_N2O","v":0},0]
[null,"Total",{"$f":"SUM(C169:C209)","v":0},0,0,0,0,0,0,null,"Total",{"$f":"SUM(L169:L209)","v":0},0,0,0,0,0,0,null,"Total",{"$f":"SUM(U169:U209)","v":0},0,0,0,0,0,0]
[]
["2) AFVs, Highway"]
[null,"VMT by Fuel and Vehicle type",null,null,null,null,null,null,null,null,"CH4 Emissions by Fuel and Vehicle Type",null,null,null,null,null,null,null,null,"N2O Emissions by Fuel and Vehicle Type"]
[null,"Vehicle activity data by fuel type and vehicle type for selected department (miles)",null,null,null,null,null,null,null,null,"CH4 Emissions = VMT × AFV EF (g/mi) × MT/g × GWP CH4",null,null,null,null,null,null,null,null,"N2O Emissions = VMT × AFV EF (g/mi) × MT/g × GWP N2O"]
[null,null,"Passenger Car","Light Truck (Vans, Pickup Trucks, SUVs)","Heavy-Duty Vehicle","TOTAL",null,null,null,null,null,"Passenger Car","Light Truck (Vans, Pickup Trucks, SUVs)","Heavy-Duty Vehicle","TOTAL",null,null,null,null,null,"Passenger Car","Light Truck (Vans, Pickup Trucks, SUVs)","Heavy-Duty Vehicle","TOTAL"]
[null,"CNG",{"$f":"SUMIFS('Mobile-Data'!$I$9:$I$1048576,'Mobile-Data'!$C$9:$C$1048576,$C$162,'Mobile-Data'!$E$9:$E$1048576,C$215,'Mobile-Data'!$G$9:$G$1048576,$B216)","v":0},{"$f":"SUMIFS('Mobile-Data'!$I$9:$I$1048576,'Mobile-Data'!$C$9:$C$1048576,$C$162,'Mobile-Data'!$E$9:$E$1048576,D$215,'Mobile-Data'!$G$9:$G$1048576,$B216)","v":0},{"$f":"SUMIFS('Mobile-Data'!$I$9:$I$1048576,'Mobile-Data'!$C$9:$C$1048576,$C$162,'Mobile-Data'!$E$9:$E$1048576,E$215,'Mobile-Data'!$G$9:$G$1048576,$B216)","v":0},{"$f":"SUM(C216:E216)","v":0},null,null,null,null,"CNG",{"$f":"C216*Factors!C225*g_kg*kg_mt*GWP_CH4","v":0},{"$f":"D216*Factors!D225*g_kg*kg_mt*GWP_CH4","v":0},{"$f":"E216*Factors!E225*g_kg*kg_mt*GWP_CH4","v":0},{"$f":"SUM(L216:N216)","v":0},null,null,null,null,"CNG",{"$f":"C216*Factors!H225*g_kg*kg_mt*GWP_N2O","v":0},{"$f":"D216*Factors!I225*g_kg*kg_mt*GWP_N2O","v":0},{"$f":"E216*Factors!J225*g_kg*kg_mt*GWP_N2O","v":0},{"$f":"SUM(U216:W216)","v":0}]
[null,"LNG","NA","NA",{"$f":"SUMIFS('Mobile-Data'!$I$9:$I$1048576,'Mobile-Data'!$C$9:$C$1048576,$C$162,'Mobile-Data'!$E$9:$E$1048576,E$215,'Mobile-Data'!$G$9:$G$1048576,$B217)","v":0},{"$f":"SUM(C217:E217)","v":0},null,null,null,null,"LNG","NA","NA",{"$f":"E217*Factors!E226*g_kg*kg_mt*GWP_CH4","v":0},{"$f":"SUM(L217:N217)","v":0},null,null,null,null,"LNG","NA","NA",{"$f":"E217*Factors!J226*g_kg*kg_mt*GWP_N2O","v":0},{"$f":"SUM(U217:W217)","v":0}]
[null,"LPG",{"$f":"SUMIFS('Mobile-Data'!$I$9:$I$1048576,'Mobile-Data'!$C$9:$C$1048576,$C$162,'Mobile-Data'!$E$9:$E$1048576,C$215,'Mobile-Data'!$G$9:$G$1048576,$B218)","v":0},{"$f":"SUMIFS('Mobile-Data'!$I$9:$I$1048576,'Mobile-Data'!$C$9:$C$1048576,$C$162,'Mobile-Data'!$E$9:$E$1048576,D$215,'Mobile-Data'!$G$9:$G$1048576,$B218)","v":0},{"$f":"SUMIFS('Mobile-Data'!$I$9:$I$1048576,'Mobile-Data'!$C$9:$C$1048576,$C$162,'Mobile-Data'!$E$9:$E$1048576,E$215,'Mobile-Data'!$G$9:$G$1048576,$B218)","v":0},0,null,null,null,null,"LPG",{"$f":"C218*Factors!C227*g_kg*kg_mt*GWP_CH4","v":0},{"$f":"D218*Factors!D227*g_kg*kg_mt*GWP_CH4","v":0},{"$f":"E218*Factors!E227*g_kg*kg_mt*GWP_CH4","v":0},0,null,null,null,null,"LPG",{"$f":"C218*Factors!H227*g_kg*kg_mt*GWP_N2O","v":0},{"$f":"D218*Factors!I227*g_kg*kg_mt*GWP_N2O","v":0},{"$f":"E218*Factors!J227*g_kg*kg_mt*GWP_N2O","v":0},0]
[null,"Ethanol (E85)",{"$f":"SUMIFS('Mobile-Data'!$I$9:$I$1048576,'Mobile-Data'!$C$9:$C$1048576,$C$162,'Mobile-Data'!$E$9:$E$1048576,C$215,'Mobile-Data'!$G$9:$G$1048576,$B219)","v":0},{"$f":"SUMIFS('Mobile-Data'!$I$9:$I$1048576,'Mobile-Data'!$C$9:$C$1048576,$C$162,'Mobile-Data'!$E$9:$E$1048576,D$215,'Mobile-Data'!$G$9:$G$1048576,$B219)","v":0},{"$f":"SUMIFS('Mobile-Data'!$I$9:$I$1048576,'Mobile-Data'!$C$9:$C$1048576,$C$162,'Mobile-Data'!$E$9:$E$1048576,E$215,'Mobile-Data'!$G$9:$G$1048576,$B219)","v":0},0,null,null,null,null,"Ethanol (E85)",{"$f":"C219*Factors!C228*g_kg*kg_mt*GWP_CH4","v":0},{"$f":"D219*Factors!D228*g_kg*kg_mt*GWP_CH4","v":0},{"$f":"E219*Factors!E228*g_kg*kg_mt*GWP_CH4","v":0},0,null,null,null,null,"Ethanol (E85)",{"$f":"C219*Factors!H228*g_kg*kg_mt*GWP_N2O","v":0},{"$f":"D219*Factors!I228*g_kg*kg_mt*GWP_N2O","v":0},{"$f":"E219*Factors!J228*g_kg*kg_mt*GWP_N2O","v":0},0]
[null,"Biodiesel (B5)",{"$f":"SUMIFS('Mobile-Data'!$I$9:$I$1048576,'Mobile-Data'!$C$9:$C$1048576,$C$162,'Mobile-Data'!$E$9:$E$1048576,C$215,'Mobile-Data'!$G$9:$G$1048576,$B220)","v":0},{"$f":"SUMIFS('Mobile-Data'!$I$9:$I$1048576,'Mobile-Data'!$C$9:$C$1048576,$C$162,'Mobile-Data'!$E$9:$E$1048576,D$215,'Mobile-Data'!$G$9:$G$1048576,$B220)","v":0},{"$f":"SUMIFS('Mobile-Data'!$I$9:$I$1048576,'Mobile-Data'!$C$9:$C$1048576,$C$162,'Mobile-Data'!$E$9:$E$1048576,E$215,'Mobile-Data'!$G$9:$G$1048576,$B220)","v":0},0,null,null,null,null,"Biodiesel (B5)",{"$f":"C220*Factors!C229*g_kg*kg_mt*GWP_CH4","v":0},{"$f":"D220*Factors!D229*g_kg*kg_mt*GWP_CH4","v":0},{"$f":"E220*Factors!E229*g_kg*kg_mt*GWP_CH4","v":0},0,null,null,null,null,"Biodiesel (B5)",{"$f":"C220*Factors!H229*g_kg*kg_mt*GWP_N2O","v":0},{"$f":"D220*Factors!I229*g_kg*kg_mt*GWP_N2O","v":0},{"$f":"E220*Factors!J229*g_kg*kg_mt*GWP_N2O","v":0},0]
[null,"Biodiesel (B20)",{"$f":"SUMIFS('Mobile-Data'!$I$9:$I$1048576,'Mobile-Data'!$C$9:$C$1048576,$C$162,'Mobile-Data'!$E$9:$E$1048576,C$215,'Mobile-Data'!$G$9:$G$1048576,$B221)","v":0},{"$f":"SUMIFS('Mobile-Data'!$I$9:$I$1048576,'Mobile-Data'!$C$9:$C$1048576,$C$162,'Mobile-Data'!$E$9:$E$1048576,D$215,'Mobile-Data'!$G$9:$G$1048576,$B221)","v":0},{"$f":"SUMIFS('Mobile-Data'!$I$9:$I$1048576,'Mobile-Data'!$C$9:$C$1048576,$C$162,'Mobile-Data'!$E$9:$E$1048576,E$215,'Mobile-Data'!$G$9:$G$1048576,$B221)","v":0},0,null,null,null,null,"Biodiesel (B20)",{"$f":"C221*Factors!C230*g_kg*kg_mt*GWP_CH4","v":0},{"$f":"D221*Factors!D230*g_kg*kg_mt*GWP_CH4","v":0},{"$f":"E221*Factors!E230*g_kg*kg_mt*GWP_CH4","v":0},0,null,null,null,null,"Biodiesel (B20)",{"$f":"C221*Factors!H230*g_kg*kg_mt*GWP_N2O","v":0},{"$f":"D221*Factors!I230*g_kg*kg_mt*GWP_N2O","v":0},{"$f":"E221*Factors!J230*g_kg*kg_mt*GWP_N2O","v":0},0]
[null,"Total",{"$f":"SUM(C216:C221)","v":0},{"$f":"SUM(D216:D221)","v":0},{"$f":"SUM(E216:E221)","v":0},0,null,null,null,null,"Total",{"$f":"SUM(L216:L221)","v":0},{"$f":"SUM(M216:M221)","v":0},{"$f":"SUM(N216:N221)","v":0},0,null,null,null,null,"Total",{"$f":"SUM(U216:U221)","v":0},{"$f":"SUM(V216:V221)","v":0},{"$f":"SUM(W216:W221)","v":0},0]
[]
[]
["3) Motorcycles and Non-Highway"]
[null,"Activity Summary by Vehicle and Fuel Type",null,null,null,null,null,null,null,null,"CH4 Emissions by Vehicle and Fuel Type",null,null,null,null,null,null,null,null,"N2O Emissions by Vehicle and Fuel Type"]
[null,"Vehicle activity data by vehicle type and fuel type for selected department. Units depend on vehicle type (gallons or miles).",null,null,null,null,null,null,null,null,"CH4 Emissions = Activity × EF (g/unit) × MT/g × GWP CH4",null,null,null,null,null,null,null,null,"N2O Emissions = Activity × EF (g/unit) × MT/g × GWP N2O"]
[null,"Vehicle Types","Unit","Gasoline","Diesel","Residual Fuel","Jet Fuel","Aviation Gasoline","TOTAL",null,"Vehicle Types","Gasoline","Diesel","Residual Fuel","Jet Fuel","Aviation Gasoline","TOTAL",null,null,"Vehicle Types","Gasoline","Diesel","Residual Fuel","Jet Fuel","Aviation Gasoline","TOTAL"]
[null,"Motorcycles (1996 +)","Miles",{"$f":"SUMIFS('Mobile-Data'!$I$9:$I$1048576,'Mobile-Data'!$E$9:$E$1048576,\"Motorcycle\",'Mobile-Data'!$C$9:$C$1048576,'Mobile-Detail Calcs'!$C$162,'Mobile-Data'!$D$9:$D$1048576,\">=1996\")","v":0},null,null,null,null,{"$f":"SUM(D229:H229)","v":0},null,"Motorcycles (1996 +)",{"$f":"D229*Factors!B236*g_kg*kg_mt*GWP_CH4","v":0},null,null,null,null,{"$f":"SUM(L229:P229)","v":0},null,null,"Motorcycles (1996 +)",{"$f":"D229*Factors!G236*g_kg*kg_mt*GWP_N2O","v":0},null,null,null,null,{"$f":"SUM(U229:Y229)","v":0}]
[null,"Motorcycles (- 1995)","Miles",{"$f":"SUMIFS('Mobile-Data'!$I$9:$I$1048576,'Mobile-Data'!$E$9:$E$1048576,\"Motorcycle\",'Mobile-Data'!$C$9:$C$1048576,'Mobile-Detail Calcs'!$C$162,'Mobile-Data'!$D$9:$D$1048576,\"<1996\")","v":0},null,null,null,null,{"$f":"SUM(D230:H230)","v":0},null,"Motorcycles (- 1995)",{"$f":"D230*Factors!B237*g_kg*kg_mt*GWP_CH4","v":0},null,null,null,null,{"$f":"SUM(L230:P230)","v":0},null,null,"Motorcycles (- 1995)",{"$f":"D230*Factors!G237*g_kg*kg_mt*GWP_N2O","v":0},null,null,null,null,{"$f":"SUM(U230:Y230)","v":0}]
[null,"Agricultural Equipment","Gallons",{"$f":"SUMIFS('Mobile-Data'!$H$9:$H$1048576,'Mobile-Data'!$C$9:$C$1048576,$C$162,'Mobile-Data'!$E$9:$E$1048576,$B231,'Mobile-Data'!$G$9:$G$1048576,D$228)","v":0},{"$f":"SUMIFS('Mobile-Data'!$H$9:$H$1048576,'Mobile-Data'!$C$9:$C$1048576,$C$162,'Mobile-Data'!$E$9:$E$1048576,$B231,'Mobile-Data'!$G$9:$G$1048576,E$228)","v":0},null,null,null,0,null,"Agricultural Equipment",{"$f":"D231*Factors!B238*g_kg*kg_mt*GWP_CH4","v":0},{"$f":"E231*Factors!C238*g_kg*kg_mt*GWP_CH4","v":0},null,null,null,0,null,null,"Agricultural Equipment",{"$f":"D231*Factors!G238*g_kg*kg_mt*GWP_N2O","v":0},{"$f":"E231*Factors!H238*g_kg*kg_mt*GWP_N2O","v":0},null,null,null,0]
[null,"Construction Equipment","Gallons",{"$f":"SUMIFS('Mobile-Data'!$H$9:$H$1048576,'Mobile-Data'!$C$9:$C$1048576,$C$162,'Mobile-Data'!$E$9:$E$1048576,$B232,'Mobile-Data'!$G$9:$G$1048576,D$228)","v":0},{"$f":"SUMIFS('Mobile-Data'!$H$9:$H$1048576,'Mobile-Data'!$C$9:$C$1048576,$C$162,'Mobile-Data'!$E$9:$E$1048576,$B232,'Mobile-Data'!$G$9:$G$1048576,E$228)","v":0},null,null,null,0,null,"Construction Equipment",{"$f":"D232*Factors!B239*g_kg*kg_mt*GWP_CH4","v":0},{"$f":"E232*Factors!C239*g_kg*kg_mt*GWP_CH4","v":0},null,null,null,0,null,null,"Construction Equipment",{"$f":"D232*Factors!G239*g_kg*kg_mt*GWP_N2O","v":0},{"$f":"E232*Factors!H239*g_kg*kg_mt*GWP_N2O","v":0},null,null,null,0]
[null,"Utility and Recreational Equipment","Gallons",{"$f":"SUMIFS('Mobile-Data'!$H$9:$H$1048576,'Mobile-Data'!$C$9:$C$1048576,$C$162,'Mobile-Data'!$E$9:$E$1048576,$B233,'Mobile-Data'!$G$9:$G$1048576,D$228)","v":0},{"$f":"SUMIFS('Mobile-Data'!$H$9:$H$1048576,'Mobile-Data'!$C$9:$C$1048576,$C$162,'Mobile-Data'!$E$9:$E$1048576,$B233,'Mobile-Data'!$G$9:$G$1048576,E$228)","v":0},null,null,null,0,null,"Utility and Recreational Equipment",{"$f":"D233*Factors!B240*g_kg*kg_mt*GWP_CH4","v":0},{"$f":"E233*Factors!C240*g_kg*kg_mt*GWP_CH4","v":0},null,null,null,0,null,null,"Utility and Recreational Equipment",{"$f":"D233*Factors!G240*g_kg*kg_mt*GWP_N2O","v":0},{"$f":"E233*Factors!H240*g_kg*kg_mt*GWP_N2O","v":0},null,null,null,0]
[null,"Aircraft","Gallons",null,null,null,{"$f":"SUMIFS('Mobile-Data'!$H$9:$H$1048576,'Mobile-Data'!$C$9:$C$1048576,$C$162,'Mobile-Data'!$E$9:$E$1048576,$B234,'Mobile-Data'!$G$9:$G$1048576,G$228)","v":0},{"$f":"SUMIFS('Mobile-Data'!$H$9:$H$1048576,'Mobile-Data'!$C$9:$C$1048576,$C$162,'Mobile-Data'!$E$9:$E$1048576,$B234,'Mobile-Data'!$G$9:$G$1048576,H$228)","v":0},0,null,"Aircraft",null,null,null,{"$f":"G234*Factors!E241*g_kg*kg_mt*GWP_CH4","v":0},{"$f":"H234*Factors!F241*g_kg*kg_mt*GWP_CH4","v":0},0,null,null,"Aircraft",null,null,null,{"$f":"G234*Factors!J241*g_kg*kg_mt*GWP_N2O","v":0},{"$f":"H234*Factors!K241*g_kg*kg_mt*GWP_N2O","v":0},0]
[null,"Ship or Boat","Gallons",{"$f":"SUMIFS('Mobile-Data'!$H$9:$H$1048576,'Mobile-Data'!$C$9:$C$1048576,$C$162,'Mobile-Data'!$E$9:$E$1048576,$B235,'Mobile-Data'!$G$9:$G$1048576,D$228)","v":0},{"$f":"SUMIFS('Mobile-Data'!$H$9:$H$1048576,'Mobile-Data'!$C$9:$C$1048576,$C$162,'Mobile-Data'!$E$9:$E$1048576,$B235,'Mobile-Data'!$G$9:$G$1048576,E$228)","v":0},{"$f":"SUMIFS('Mobile-Data'!$H$9:$H$1048576,'Mobile-Data'!$C$9:$C$1048576,$C$162,'Mobile-Data'!$E$9:$E$1048576,$B235,'Mobile-Data'!$G$9:$G$1048576,F$228)","v":0},null,null,0,null,"Ship or Boat",{"$f":"D235*Factors!B242*g_kg*kg_mt*GWP_CH4","v":0},{"$f":"E235*Factors!C242*g_kg*kg_mt*GWP_CH4","v":0},{"$f":"F235*Factors!D242*g_kg*kg_mt*GWP_CH4","v":0},null,null,0,null,null,"Ship or Boat",{"$f":"D235*Factors!G242*g_kg*kg_mt*GWP_N2O","v":0},{"$f":"E235*Factors!H242*g_kg*kg_mt*GWP_N2O","v":0},{"$f":"F235*Factors!I242*g_kg*kg_mt*GWP_N2O","v":0},null,null,0]
[null,"Locomotive","Gallons",null,{"$f":"SUMIFS('Mobile-Data'!$H$9:$H$1048576,'Mobile-Data'!$C$9:$C$1048576,$C$162,'Mobile-Data'!$E$9:$E$1048576,$B236,'Mobile-Data'!$G$9:$G$1048576,E$228)","v":0},null,null,null,0,null,"Locomotive",null,{"$f":"E236*Factors!C243*g_kg*kg_mt*GWP_CH4","v":0},null,null,null,0,null,null,"Locomotive",null,{"$f":"E236*Factors!H243*g_kg*kg_mt*GWP_N2O","v":0},null,null,null,0]
[null,null,null,null,null,null,null,null,null,null,"Total",{"$f":"SUM(L229:L233)","v":0},{"$f":"SUM(M229:M233)","v":0},{"$f":"SUM(N229:N233)","v":0},{"$f":"SUM(O229:O233)","v":0},{"$f":"SUM(P229:P233)","v":0},0,null,null,"Total",{"$f":"SUM(U229:U233)","v":0},{"$f":"SUM(V229:V233)","v":0},{"$f":"SUM(W229:W233)","v":0},{"$f":"SUM(X229:X233)","v":0},{"$f":"SUM(Y229:Y233)","v":0},0]
[]
["Totals"]
[null,"Non-CO2 Emissions, Current Department"]
[null,"Current department:",{"$f":"mob_nonCO2_current_dept","v":0}]
[]
[null,null,"CH4","N2O","TOTAL"]
[null,"Highway Vehicles",{"$f":"SUM(L210:Q210)","v":0},{"$f":"SUM(U210:Z210)","v":0},{"$f":"SUM(C244:D244)","v":0}]
[null,"AFVs",{"$f":"SUM(L222:N222)","v":0},{"$f":"SUM(U222:W222)","v":0},{"$f":"SUM(C245:D245)","v":0}]
[null,"Non-highway/Motorcycles",{"$f":"SUM(L237:P237)","v":0},{"$f":"SUM(U237:Y237)","v":0},0]
[null,"Total",{"$f":"SUM(C244:C246)","v":0},{"$f":"SUM(D244:D246)","v":0},0]
[]
["Non-CO2 Emissions, All Departments"]
[null,null,"CH4","N2O","TOTAL"]
["Dstart",{"$f":"B129","v":0},0,0,{"$f":"SUM(C251:D251)","v":0}]
[null,{"$f":"B130","v":0},0,0,0]
[null,0,0,0,0]
[null,0,0,0,0]
[null,0,0,0,{"$f":"SUM(C255:D255)","v":0}]
[null,0,0,0,0]
[null,0,0,0,0]
[null,0,0,0,0]
[null,0,0,0,0]
[null,0,0,0,0]
[null,0,0,0,0]
[null,0,0,0,0]
[null,0,0,0,0]
[null,0,0,0,0]
[null,0,0,0,0]
[null,0,0,0,0]
[null,0,0,0,0]
[null,0,0,0,0]
[null,0,0,0,0]
[null,0,0,0,0]
[null,"Total",{"$f":"SUM(C251:C270)","v":0},{"$f":"SUM(D251:D270)","v":0},0]
[]
[]
[]
["Tribal GHG Inventory Tool: Government Operations Module"]

{"sheet":"Solid Waste-Control","index":16,"n_rows":42,"n_cols":14,"rows_kept":42,"cut":false,"hidden":false,"merged":[[14,2,14,5],[16,2,16,10],[41,0,41,11]]}
["Solid Waste - Control"]
[]
[]
[]
[]
[]
[1,"Please answer the following questions about your tribe's solid waste services."]
[]
[null,"1) Does your tribe have operational control over any landfills?"]
[1]
[]
[{"$f":"IF($A$10=3, \"Show\", \"Hide\")","v":"Hide"},null,"If no, then it is optional to report emissions for waste generated within your borders, but landfilled elsewhere, as Scope 3 emissions."]
["Hide",null,"If you would like to do so, please enter results on the Waste Generation sheet. "]
["Hide"]
["Hide"]
["Hide"]
["Hide"]
["Hide"]
["Hide"]
[{"$f":"IF($A$10=2, \"Show\", \"Hide\")","v":"Hide"},"2) To which department do your solid waste services belong?"]
["Hide",null,0]
["Hide"]
["Hide"]
["Hide"]
["Hide"]
["Hide","3) Enter up to 10 Landfills below."]
["Hide",null,"Landfill Name",null,"Does the landfill have a LFG collection system?",null,"If yes, is the LFG collection system comprehensive or partial?"]
[{"$f":"IF($A$10=2, \"Show\", \"Hide\")","v":"Hide"},1,null,null,null,null,null,null,null,null,null,null,"To hide"]
[{"$f":"IF($A$10=2, \"Show\", \"Hide\")","v":"Hide"},2,null,null,null,null,null,null,null,null,null,null,"Any yes?",{"$f":"IF(OR(SW_LF1q1=\"yes\", SW_LF2q1=\"yes\", SW_LF3q1=\"yes\", SW_LF4q1=\"yes\", SW_LF5q1=\"yes\", SW_LF6q1=\"yes\", SW_LF7q1=\"yes\", SW_LF8q1=\"yes\", SW_LF9q1=\"yes\", SW_LF10q1=\"yes\"), TRUE, FALSE)","v":false}]
["Hide",3,null,null,null,null,null,null,null,null,null,null,"Any no?",{"$f":"IF(OR(SW_LF1q1=\"no\", SW_LF2q1=\"no\", SW_LF3q1=\"no\", SW_LF4q1=\"no\", SW_LF5q1=\"no\", SW_LF6q1=\"no\", SW_LF7q1=\"no\", SW_LF8q1=\"no\", SW_LF9q1=\"no\", SW_LF10q1=\"no\"), TRUE, FALSE)","v":false}]
["Hide",4,null,null,null,null,null,null,null,null,null,null,"Any comp?",{"$f":"IF(OR(SW_LF1q2=\"comprehensive\", SW_LF2q2=\"comprehensive\", SW_LF3q2=\"comprehensive\", SW_LF4q2=\"comprehensive\", SW_LF5q2=\"comprehensive\", SW_LF6q2=\"comprehensive\", SW_LF7q2=\"comprehensive\", SW_LF8q2=\"comprehensive\", SW_LF9q2=\"comprehensive\", SW_LF10q2=\"comprehensive\"), TRUE, FALSE)","v":false}]
["Hide",5,null,null,null,null,null,null,null,null,null,null,"Any part?",{"$f":"IF(OR(SW_LF1q2=\"partial\", SW_LF2q2=\"partial\", SW_LF3q2=\"partial\", SW_LF4q2=\"partial\", SW_LF5q2=\"partial\", SW_LF6q2=\"partial\", SW_LF7q2=\"partial\", SW_LF8q2=\"partial\", SW_LF9q2=\"partial\", SW_LF10q2=\"partial\"), TRUE, FALSE)","v":false}]
["Hide",6]
["Hide",7]
["Hide",8]
["Hide",9]
["Hide",10]
["Hide"]
[{"$f":"IF($A$10=2, \"Show\", \"Hide\")","v":"Hide"},null,null,null,"Please enter your landfill data on the next page (Solid Waste-Entry)."]
[]
[]
["Tribal GHG Inventory Tool: Government Operations Module"]

{"sheet":"Solid Waste-Entry","index":17,"n_rows":107,"n_cols":17,"rows_kept":107,"cut":false,"hidden":false,"merged":[[74,1,74,2],[106,0,106,13]]}
["Solid Waste - Entry, Calculation & Summary"]
[]
[]
[]
[]
[]
[]
[]
[{"$f":"IF('Solid Waste-Control'!$A$10=2, \"Show\", \"Hide\")","v":"Hide"},"Scope 3 Waste Emissions"]
[{"$f":"IF('Solid Waste-Control'!$A$10=2, \"Show\", \"Hide\")","v":"Hide"}]
[{"$f":"IF(SW_anyNo=TRUE, \"Show\", \"Hide\")","v":"Hide"},"Landfills with No LFG Collection System"]
["Hide"]
["Hide","For these landfills that do not have LFG collection systems, you need to use the California Air Resources Board's Landfill Emissions Tool, which is based on the IPCC First Order Decay (FOD) model."]
["Hide"]
["Hide","To use the model, you will need the following information for each landfill:"]
["Hide","- Annual waste deposited in landfill (can be derived from population and waste deposition data)"]
["Hide","- Opening and closing year of landfill"]
["Hide"]
["Hide",{"$f":" \"Once you have run the model, please paste the final \" & MyYear &\" methane (CH4) emissions output for each landfill in the yellow cells below:\"","v":"Once you have run the model, please paste the final  methane (CH4) emissions output for each landfill in the yellow cells below:"}]
["Hide","Note: Be sure to paste Values only. To do this, once you have copied the emissions output cell, right click on the appropriate cell below, select \"Paste Special\" then select \"Values.\""]
["Hide"]
[{"$f":"IF(SW_anyNo=TRUE, \"Show\", \"Hide\")","v":"Hide"},"Landfill Name","CH4 Emissions (MT CO2e)"]
[{"$f":"IF(SW_LF1q1=\"No\", \"Show\", \"Hide\")","v":"Hide"},{"$f":"SW_LF1name","v":0}]
[{"$f":"IF(SW_LF2q1=\"No\", \"Show\", \"Hide\")","v":"Hide"},{"$f":"SW_LF2name","v":0}]
[{"$f":"IF(SW_LF3q1=\"No\", \"Show\", \"Hide\")","v":"Hide"},{"$f":"SW_LF3name","v":0}]
[{"$f":"IF(SW_LF4q1=\"No\", \"Show\", \"Hide\")","v":"Hide"},{"$f":"SW_LF4name","v":0}]
[{"$f":"IF(SW_LF5q1=\"No\", \"Show\", \"Hide\")","v":"Hide"},{"$f":"SW_LF5name","v":0}]
[{"$f":"IF(SW_LF6q1=\"No\", \"Show\", \"Hide\")","v":"Hide"},{"$f":"SW_LF6name","v":0}]
[{"$f":"IF(SW_LF7q1=\"No\", \"Show\", \"Hide\")","v":"Hide"},{"$f":"SW_LF7name","v":0}]
[{"$f":"IF(SW_LF8q1=\"No\", \"Show\", \"Hide\")","v":"Hide"},{"$f":"SW_LF8name","v":0}]
[{"$f":"IF(SW_LF9q1=\"No\", \"Show\", \"Hide\")","v":"Hide"},{"$f":"SW_LF9name","v":0}]
[{"$f":"IF(SW_LF10q1=\"No\", \"Show\", \"Hide\")","v":"Hide"},{"$f":"SW_LF10name","v":0}]
[{"$f":"IF(SW_anyNo=TRUE, \"Show\", \"Hide\")","v":"Hide"}]
[{"$f":"IF(AND(SW_anyYes=TRUE, SW_anyComp=TRUE), \"Show\", \"Hide\")","v":"Hide"},"Landfills with Comprehensive LFG Collection Systems"]
["Hide"]
["Hide","Note: If you would like to use the CARB Landfill Emissions Tool to calculate the emissions for any landfills, please select 'No' when asked if the landfill has an LFG collection system."]
["Hide"]
["Hide","CH4 emitted = LFG Collected × Fraction CH4 in LFG × {(1-Destruction Efficiency) + [((1-Collection Efficiency)/Collection Efficiency) × (1-Oxidation Efficiency)]} × MT/MMSCF × GWP"]
["Hide"]
["Hide","Landfill Name","LFG Collected (MMSCF/yr)","Fraction of CH4 in LFG","CH4 Destruction Efficiency","CH4 Collection Efficiency","Oxidation Factor","MT CH4 / MMSCF","MT CH4","× GWP =","MT CO2e"]
["Hide",null,null,null,null,null,null,null,null,null,null,null,null,null,null,null,true]
[{"$f":"IF(AND(SW_LF1q1=\"yes\", SW_LF1q2=\"comprehensive\"), \"Show\", \"Hide\")","v":"Hide"},{"$f":"SW_LF1name","v":0},null,0.5,0.99,0.75,0.1,19.125,{"$f":"IFERROR(C42*D42*((1-E42) + (((1-F42)/F42)*(1-G42)))*H42,\"0\")","v":0},{"$f":"CH4_CO2e","v":21},{"$f":"I42*J42","v":0},null,null,null,null,null,true]
[{"$f":"IF(AND(SW_LF2q1=\"yes\", SW_LF2q2=\"comprehensive\"), \"Show\", \"Hide\")","v":"Hide"},{"$f":"SW_LF2name","v":0},null,0.5,0.99,0.75,{"$f":"0.1*0.1","v":1.0000000000000002E-2},19.125,{"$f":"IFERROR(C43*D43*((1-E43) + (((1-F43)/F43)*(1-G43)))*H43,\"0\")","v":0},21,{"$f":"I43*J43","v":0}]
[{"$f":"IF(AND(SW_LF3q1=\"yes\", SW_LF3q2=\"comprehensive\"), \"Show\", \"Hide\")","v":"Hide"},{"$f":"SW_LF3name","v":0},null,0.5,0.99,0.75,1.0000000000000002E-2,19.125,0,21,0]
[{"$f":"IF(AND(SW_LF4q1=\"yes\", SW_LF4q2=\"comprehensive\"), \"Show\", \"Hide\")","v":"Hide"},{"$f":"SW_LF4name","v":0},null,0.5,0.99,0.75,1.0000000000000002E-2,19.125,0,21,0]
[{"$f":"IF(AND(SW_LF5q1=\"yes\", SW_LF5q2=\"comprehensive\"), \"Show\", \"Hide\")","v":"Hide"},{"$f":"SW_LF5name","v":0},null,0.5,0.99,0.75,1.0000000000000002E-2,19.125,0,21,0]
[{"$f":"IF(AND(SW_LF6q1=\"yes\", SW_LF6q2=\"comprehensive\"), \"Show\", \"Hide\")","v":"Hide"},{"$f":"SW_LF6name","v":0},null,0.5,0.99,0.75,1.0000000000000002E-2,19.125,0,21,0]
[{"$f":"IF(AND(SW_LF7q1=\"yes\", SW_LF7q2=\"comprehensive\"), \"Show\", \"Hide\")","v":"Hide"},{"$f":"SW_LF7name","v":0},null,0.5,0.99,0.75,1.0000000000000002E-2,19.125,0,21,0]
[{"$f":"IF(AND(SW_LF8q1=\"yes\", SW_LF8q2=\"comprehensive\"), \"Show\", \"Hide\")","v":"Hide"},{"$f":"SW_LF8name","v":0},null,0.5,0.99,0.75,1.0000000000000002E-2,19.125,0,21,0]
[{"$f":"IF(AND(SW_LF9q1=\"yes\", SW_LF9q2=\"comprehensive\"), \"Show\", \"Hide\")","v":"Hide"},{"$f":"SW_LF9name","v":0},null,0.5,0.99,0.75,1.0000000000000002E-2,19.125,0,21,0]
[{"$f":"IF(AND(SW_LF10q1=\"yes\", SW_LF10q2=\"comprehensive\"), \"Show\", \"Hide\")","v":"Hide"},{"$f":"SW_LF10name","v":0},null,0.5,0.99,0.75,1.0000000000000002E-2,19.125,0,21,0]
[{"$f":"IF(AND(SW_anyYes=TRUE, SW_anyComp=TRUE), \"Show\", \"Hide\")","v":"Hide"}]
[{"$f":"IF(AND(SW_anyYes=TRUE, SW_anyPart=TRUE), \"Show\", \"Hide\")","v":"Hide"},"Landfills with Partial LFG Collection Systems"]
["Hide"]
["Hide","Note: If you would like to use the CARB Landfill Emissions Tool to calculate the emissions for any landfills, please select 'No' when asked if the landfill has an LFG collection system."]
["Hide"]
["Hide","CH4 emitted = LFG Collected × Fraction CH4 in LFG × {(1-Destruction Efficiency) + [(1/Collection Efficiency) × (1-Oxidation Efficiency)] × [Uncollected Area Factor + (1-Collection Efficiency)]} × MT/MMSCF × GWP"]
["Hide"]
["Hide","Landfill Name","LFG Collected (MMSCF/yr)","Fraction of CH4 in LFG","CH4 Destruction Efficiency","CH4 Collection Efficiency","Oxidation Factor","Uncollected Area Factor","MT CH4 / MMSCF","MT CH4","× GWP =","MT CO2e"]
["Hide",null,null,null,null,null,null,null,null,null,null,null,null,null,null,null,true]
[{"$f":"IF(AND(SW_LF1q1=\"yes\", SW_LF1q2=\"partial\"), \"Show\", \"Hide\")","v":"Hide"},{"$f":"SW_LF1name","v":0},null,0.5,0.99,0.75,{"$f":"0.1*0.1","v":1.0000000000000002E-2},null,19.125,{"$f":"IFERROR(C61*D61*((1-E61)+((1/F61)*(1-G61))*(H61+(1-F61)))*I61,\"0\")","v":0},{"$f":"CH4_CO2e","v":21},{"$f":"J61*K61","v":0},null,null,null,null,true]
[{"$f":"IF(AND(SW_LF2q1=\"yes\", SW_LF2q2=\"partial\"), \"Show\", \"Hide\")","v":"Hide"},{"$f":"SW_LF2name","v":0},null,0.5,0.99,0.75,1.0000000000000002E-2,null,19.125,{"$f":"IFERROR(C62*D62*((1-E62)+((1/F62)*(1-G62))*(H62+(1-F62)))*I62,\"0\")","v":0},21,0]
[{"$f":"IF(AND(SW_LF3q1=\"yes\", SW_LF3q2=\"partial\"), \"Show\", \"Hide\")","v":"Hide"},{"$f":"SW_LF3name","v":0},null,0.5,0.99,0.75,1.0000000000000002E-2,null,19.125,0,21,0]
[{"$f":"IF(AND(SW_LF4q1=\"yes\", SW_LF4q2=\"partial\"), \"Show\", \"Hide\")","v":"Hide"},{"$f":"SW_LF4name","v":0},null,0.5,0.99,0.75,1.0000000000000002E-2,null,19.125,0,21,0]
[{"$f":"IF(AND(SW_LF5q1=\"yes\", SW_LF5q2=\"partial\"), \"Show\", \"Hide\")","v":"Hide"},{"$f":"SW_LF5name","v":0},null,0.5,0.99,0.75,1.0000000000000002E-2,null,19.125,0,21,0]
[{"$f":"IF(AND(SW_LF6q1=\"yes\", SW_LF6q2=\"partial\"), \"Show\", \"Hide\")","v":"Hide"},{"$f":"SW_LF6name","v":0},null,0.5,0.99,0.75,1.0000000000000002E-2,null,19.125,0,21,0]
[{"$f":"IF(AND(SW_LF7q1=\"yes\", SW_LF7q2=\"partial\"), \"Show\", \"Hide\")","v":"Hide"},{"$f":"SW_LF7name","v":0},null,0.5,0.99,0.75,1.0000000000000002E-2,null,19.125,0,21,0]
[{"$f":"IF(AND(SW_LF8q1=\"yes\", SW_LF8q2=\"partial\"), \"Show\", \"Hide\")","v":"Hide"},{"$f":"SW_LF8name","v":0},null,0.5,0.99,0.75,1.0000000000000002E-2,null,19.125,0,21,0]
[{"$f":"IF(AND(SW_LF9q1=\"yes\", SW_LF9q2=\"partial\"), \"Show\", \"Hide\")","v":"Hide"},{"$f":"SW_LF9name","v":0},null,0.5,0.99,0.75,1.0000000000000002E-2,null,19.125,0,21,0]
[{"$f":"IF(AND(SW_LF10q1=\"yes\", SW_LF10q2=\"partial\"), \"Show\", \"Hide\")","v":"Hide"},{"$f":"SW_LF10name","v":0},null,0.5,0.99,0.75,1.0000000000000002E-2,null,19.125,0,21,0]
[]
[{"$f":"IF('Solid Waste-Control'!$A$10=1, \"Show\", \"Hide\")","v":"Show"},"Solid Waste Emissions Summary"]
[{"$f":"IF('Solid Waste-Control'!$A$10=1, \"Show\", \"Hide\")","v":"Show"}]
[{"$f":"IF('Solid Waste-Control'!$A$10=1, \"Show\", \"Hide\")","v":"Show"}]
[{"$f":"IF('Solid Waste-Control'!$A$10=1, \"Show\", \"Hide\")","v":"Show"},"Total Landfill Emissions (MT CO2e)"]
[{"$f":"IF('Solid Waste-Control'!$A$10=1, \"Show\", \"Hide\")","v":"Show"},"Landfill System","CH4"]
[{"$f":"IF('Solid Waste-Control'!$A$10=1, \"Show\", \"Hide\")","v":"Show"},"No LFG collection",{"$f":"SUM('Solid Waste-Entry'!$C$23:$C$32)","v":0}]
[{"$f":"IF('Solid Waste-Control'!$A$10=1, \"Show\", \"Hide\")","v":"Show"},"Comprehensive LFG Collection",{"$f":"SUM('Solid Waste-Entry'!$K$42:$K$51)","v":0}]
[{"$f":"IF('Solid Waste-Control'!$A$10=1, \"Show\", \"Hide\")","v":"Show"},"Partial LFG Collection",{"$f":"SUM('Solid Waste-Entry'!$L$61:$L$70)","v":0}]
[{"$f":"IF('Solid Waste-Control'!$A$10=1, \"Show\", \"Hide\")","v":"Show"},{"$f":"\"Total Emissions from Landfills in \"&MyCity","v":"Total Emissions from Landfills in "},{"$f":"SUM(C77:C79)","v":0}]
[{"$f":"IF('Solid Waste-Control'!$A$10=1, \"Show\", \"Hide\")","v":"Show"}]
[{"$f":"IF('Solid Waste-Control'!$A$10=1, \"Show\", \"Hide\")","v":"Show"}]
[{"$f":"IF('Solid Waste-Control'!$A$10=1, \"Show\", \"Hide\")","v":"Show"}]
[{"$f":"IF('Solid Waste-Control'!$A$10=1, \"Show\", \"Hide\")","v":"Show"}]
[{"$f":"IF('Solid Waste-Control'!$A$10=1, \"Show\", \"Hide\")","v":"Show"}]
[{"$f":"IF('Solid Waste-Control'!$A$10=1, \"Show\", \"Hide\")","v":"Show"}]
[{"$f":"IF('Solid Waste-Control'!$A$10=1, \"Show\", \"Hide\")","v":"Show"}]
[{"$f":"IF('Solid Waste-Control'!$A$10=1, \"Show\", \"Hide\")","v":"Show"}]
[{"$f":"IF('Solid Waste-Control'!$A$10=1, \"Show\", \"Hide\")","v":"Show"}]
[{"$f":"IF('Solid Waste-Control'!$A$10=1, \"Show\", \"Hide\")","v":"Show"}]
[{"$f":"IF('Solid Waste-Control'!$A$10=1, \"Show\", \"Hide\")","v":"Show"}]
[{"$f":"IF('Solid Waste-Control'!$A$10=1, \"Show\", \"Hide\")","v":"Show"}]
[{"$f":"IF('Solid Waste-Control'!$A$10=1, \"Show\", \"Hide\")","v":"Show"}]
[{"$f":"IF('Solid Waste-Control'!$A$10=1, \"Show\", \"Hide\")","v":"Show"}]
[{"$f":"IF('Solid Waste-Control'!$A$10=1, \"Show\", \"Hide\")","v":"Show"}]
[{"$f":"IF('Solid Waste-Control'!$A$10=1, \"Show\", \"Hide\")","v":"Show"}]
[{"$f":"IF('Solid Waste-Control'!$A$10=1, \"Show\", \"Hide\")","v":"Show"}]
[{"$f":"IF('Solid Waste-Control'!$A$10=1, \"Show\", \"Hide\")","v":"Show"}]
[{"$f":"IF('Solid Waste-Control'!$A$10=1, \"Show\", \"Hide\")","v":"Show"}]
[{"$f":"IF('Solid Waste-Control'!$A$10=1, \"Show\", \"Hide\")","v":"Show"}]
[{"$f":"IF('Solid Waste-Control'!$A$10=1, \"Show\", \"Hide\")","v":"Show"}]
[{"$f":"IF('Solid Waste-Control'!$A$10=1, \"Show\", \"Hide\")","v":"Show"}]
[{"$f":"IF('Solid Waste-Control'!$A$10=1, \"Show\", \"Hide\")","v":"Show"}]
[{"$f":"IF('Solid Waste-Control'!$A$10=1, \"Show\", \"Hide\")","v":"Show"}]
[]
[]
["Tribal GHG Inventory Tool: Government Operations Module"]

{"sheet":"Wastewater-Control","index":18,"n_rows":64,"n_cols":19,"rows_kept":64,"cut":false,"hidden":false,"merged":[[9,16,9,18],[63,0,63,14]]}
["Wastewater - Control"]
[]
[]
[null,"Please answer the following questions about your wastewater treatment system."]
[]
[null,"1) To which tribal department does your wastewater treatment system belong?"]
[null,null,0]
[]
[null,"2) Do you have one or more facilities where wastewater is treated in anaerobic conditions?",null,null,null,null,null,null,null,null,null,null,null,null,null,null,"To be hidden"]
[null,null,null,null,null,null,null,null,null,null,null,null,null,null,null,null,"Control"]
[null,null,null,null,null,null,null,null,null,null,null,null,null,null,null,null,2,1,{"$f":"IF(R11=1, TRUE, FALSE)","v":true}]
[null,null,null,null,null,null,null,null,null,null,null,null,null,null,null,null,3,1,true]
[null,null,null,null,null,null,null,null,null,null,null,null,null,null,null,null,4,1,{"$f":"IF(R13=1, TRUE, FALSE)","v":true}]
[null,null,null,null,null,null,null,null,null,null,null,null,null,null,null,null,5,1,true]
[null,"3) Do you have one or more facilities where wastewater is treated in aerobic conditions?",null,null,null,null,null,null,null,null,null,null,null,null,null,null,6,1,true]
[null,null,null,null,null,null,null,null,null,null,null,null,null,null,null,null,7,2,false]
[null,null,null,null,null,null,null,null,null,null,null,null,null,null,null,null,8,1,true]
[null,null,null,null,null,null,null,null,null,null,null,null,null,null,null,null,9,2,false]
[null,null,null,null,null,null,null,null,null,null,null,null,null,null,null,null,10,2,false]
[]
[null,"4) Is data available for your wastewater system on both the amount of digester gas produced per day and the fraction of CH4 in the biogas?"]
[]
[]
[]
[]
[]
[null,"5) Is data available for your wastewater system on both the BOD5 influent to your WWT process and the amount of BOD5 removed during primary treatment?"]
[]
[]
[]
[]
[]
[null,"6) Is any portion of your population served by septic systems?"]
[]
[]
[]
[]
[]
[null,"7) Is there any industrial nitrogen load into your wastewater treatment system?"]
[]
[]
[]
[]
[]
[null,"8) Do one or more centralized wastewater treatment plants conduct nitrification/denitrification?"]
[]
[]
[]
[]
[]
[null,"9) Do one or more centralized wastewater treatment plants not conduct nitrification/denitrification?"]
[]
[]
[]
[]
[]
[null,"10) Do you collect measurements of Nitrogen load in your system's effluent discharged to water bodies?"]
[]
[]
[]
[]
[]
[]
["Tribal GHG Inventory Tool: Government Operations Module"]

{"sheet":"Wastewater-Entry","index":19,"n_rows":48,"n_cols":3,"rows_kept":48,"cut":false,"hidden":false,"merged":[[47,0,47,10]]}
["Wastewater - Entry"]
[]
[]
[]
[]
[]
[]
[]
["Information on population served by various systems."]
[]
[{"$f":"IF(wwt_control_q8=TRUE, \"Show\", \"Hide\")","v":"Show"},"Population Served by Facilities with Nitrification/Denitrification"]
[{"$f":"IF(wwt_control_q8=TRUE, \"Show\", \"Hide\")","v":"Show"},null,"people"]
[{"$f":"IF(wwt_control_q8=TRUE, \"Show\", \"Hide\")","v":"Show"}]
[{"$f":"IF(wwt_control_q9=TRUE, \"Show\", \"Hide\")","v":"Hide"},"Population Served by Facilities without Nitrification/Denitrification"]
[{"$f":"IF(wwt_control_q9=TRUE, \"Show\", \"Hide\")","v":"Hide"},null,"people"]
[{"$f":"IF(wwt_control_q9=TRUE, \"Show\", \"Hide\")","v":"Hide"}]
[{"$f":"IF(wwt_control_q2=TRUE, \"Show\", \"Hide\")","v":"Show"},"Population Served by Anaerobic Treatment Facilities"]
[{"$f":"IF(wwt_control_q2=TRUE, \"Show\", \"Hide\")","v":"Show"},null,"people"]
[{"$f":"IF(wwt_control_q2=TRUE, \"Show\", \"Hide\")","v":"Show"}]
[{"$f":"IF(wwt_control_q3=TRUE, \"Show\", \"Hide\")","v":"Show"},"Population Served by Aerobic Treatment Facilities"]
[{"$f":"IF(wwt_control_q3=TRUE, \"Show\", \"Hide\")","v":"Show"},null,"people"]
[{"$f":"IF(wwt_control_q3=TRUE, \"Show\", \"Hide\")","v":"Show"}]
[{"$f":"IF(wwt_control_q6=TRUE,\"Show\",\"Hide\")","v":"Show"},"Population Served by Septic Systems"]
[{"$f":"IF(wwt_control_q6=TRUE,\"Show\",\"Hide\")","v":"Show"},null,"people"]
[{"$f":"IF(wwt_control_q6=TRUE,\"Show\",\"Hide\")","v":"Show"}]
["Site-Specific Data Collected"]
[]
[{"$f":"IF(AND(wwt_control_q2=TRUE, wwt_control_q4=TRUE),\"Show\",\"Hide\")","v":"Show"},"Digester Biogas Produced Daily"]
["Show",null,"ft3/day"]
["Show"]
["Show","Percentage of CH4 in Biogas (measured)"]
["Show"]
["Show"]
[{"$f":"IF(AND(wwt_control_q2=TRUE, wwt_control_q5=TRUE),\"Show\",\"Hide\")","v":"Show"},"System BOD5 Input"]
["Show",null,"kg BOD5 / day"]
["Show"]
["Show","Percentage of BOD5 Removed in Primary Treatment"]
["Show"]
["Show"]
[{"$f":"IF(wwt_control_q7=TRUE,\"Show\",\"Hide\")","v":"Hide"},"Industrial N Load"]
[{"$f":"IF(wwt_control_q7=TRUE,\"Show\",\"Hide\")","v":"Hide"},null,"kg N/day"]
[{"$f":"IF(wwt_control_q7=TRUE,\"Show\",\"Hide\")","v":"Hide"}]
[{"$f":"IF(wwt_control_q8=TRUE,\"Show\",\"Hide\")","v":"Show"},"Average Total Nitrogen Discharged (measured)"]
[{"$f":"IF(wwt_control_q8=TRUE,\"Show\",\"Hide\")","v":"Show"},null,"kg N/day"]
[{"$f":"IF(wwt_control_q8=TRUE,\"Show\",\"Hide\")","v":"Show"}]
[]
[]
["Tribal GHG Inventory Tool: Government Operations Module"]

{"sheet":"Wastewater- Calcs","index":20,"n_rows":90,"n_cols":14,"rows_kept":90,"cut":false,"hidden":false,"merged":[[11,1,11,3],[13,1,13,2],[14,1,14,2],[15,1,15,2],[16,1,16,2],[89,0,89,14],[20,1,20,10],[25,1,25,11],[30,1,30,9],[35,1,35,11],[40,1,40,9],[73,1,73,7],[45,1,45,7],[50,1,50,7],[55,1,55,8],[60,1,60,13],[62,1,62,13],[64,1,64,13],[66,1,66,13],[68,1,68,13],[70,1,70,13]]}
["Wastewater - Calculation & Sumary"]
[]
[]
[]
[]
[]
[]
[]
[]
[]
[]
[null,"GHG Emissions Summary"]
[null,null,null,"MT CO2e"]
[null,"CO2",null,0]
[null,"CH4",null,{"$f":"K23+L28+J33+L38+J43","v":0}]
[null,"N2O",null,{"$f":"H48+H53+I58+N64+N66+N68+N70","v":0}]
[null,"Total Emissions from Wastewater Treatment",null,{"$f":"SUM(D14:D16)","v":0}]
[]
[null,"Background Calculations"]
[]
[{"$f":"IF(AND(wwt_control_q2=TRUE, wwt_control_q4=TRUE), \"Show\", \"Hide\")","v":"Show"},"LGOP Equation 10.1 - Stationary CH4 from Incomplete Combustion of Digester Gas  (anaerobic facilities only, site-specific data)"]
[{"$f":"IF(AND(wwt_control_q2=TRUE, wwt_control_q4=TRUE), \"Show\", \"Hide\")","v":"Show"},"Measured Digester Gas Production (ft3/day)","× Measured % CH4 in Digester Gas"," × Methane Density (g/m3)","× 1 - CH4 Destruction Efficiency","× m3/ft3","× day/yr","× MT/g =","MT CH4","× GWP =","MT CO2e"]
[{"$f":"IF(AND(wwt_control_q2=TRUE, wwt_control_q4=TRUE), \"Show\", \"Hide\")","v":"Show"},{"$f":"wwt_entry_biogas","v":0},{"$f":"wwt_entry_biogasCH4","v":0},{"$f":"wwt_factor_CH4density","v":662},{"$f":"1-wwt_factors_DE","v":1.0000000000000009E-2},{"$f":"ft3_m3","v":2.8316846600000001E-2},{"$f":"perday_peryr","v":365.25},{"$f":"g_MT","v":9.9999999999999995E-7},{"$f":"B23*C23*D23*E23*F23*G23*H23","v":0},{"$f":"CH4_CO2e","v":21},{"$f":"IF(AND(wwt_control_q2=TRUE, wwt_control_q4=TRUE), I23*J23, 0)","v":0}]
[{"$f":"IF(AND(wwt_control_q2=TRUE, wwt_control_q4=TRUE), \"Show\", \"Hide\")","v":"Show"}]
[{"$f":"IF(AND(wwt_control_q2=TRUE, wwt_control_q4=TRUE), \"Show\", \"Hide\")","v":"Show"}]
[{"$f":"IF(AND(wwt_control_q2=TRUE, wwt_control_q4=FALSE), \"Show\", \"Hide\")","v":"Hide"},"LGOP Equation 10.2 - Stationary CH4 from Incomplete Combustion of Digester Gas  (anaerobic facilities only, default data)"]
[{"$f":"IF(AND(wwt_control_q2=TRUE, wwt_control_q4=FALSE), \"Show\", \"Hide\")","v":"Hide"},"Population Served by Anaerobic Digesters","× Default Digester Gas Production (ft3/person/day)","× Default % CH4 in Digester Gas","× Methane Density (g/m3)"," × 1- CH4 Destruction Efficiency","× m3/ft3","× day/yr","× MT/g =","MT CH4","× GWP =","MT CO2e"]
[{"$f":"IF(AND(wwt_control_q2=TRUE, wwt_control_q4=FALSE), \"Show\", \"Hide\")","v":"Hide"},{"$f":"wwt_entry_popAnaerobic","v":0},{"$f":"wwt_factors_biogas_def","v":1},{"$f":"1-wwt_factors_FCH4_def","v":0.35},{"$f":"wwt_factor_CH4density","v":662},{"$f":"1-wwt_factors_DE","v":1.0000000000000009E-2},{"$f":"ft3_m3","v":2.8316846600000001E-2},{"$f":"perday_peryr","v":365.25},{"$f":"g_MT","v":9.9999999999999995E-7},{"$f":"B28*C28*D28*E28*F28*G28*H28*I28","v":0},{"$f":"CH4_CO2e","v":21},{"$f":"IF(AND(wwt_control_q2=TRUE, wwt_control_q4=FALSE), J28*K28, 0)","v":0}]
[{"$f":"IF(AND(wwt_control_q2=TRUE, wwt_control_q4=FALSE), \"Show\", \"Hide\")","v":"Hide"}]
[{"$f":"IF(AND(wwt_control_q2=TRUE, wwt_control_q4=FALSE), \"Show\", \"Hide\")","v":"Hide"}]
[{"$f":"IF(AND(wwt_control_q2=TRUE, wwt_control_q5=TRUE), \"Show\", \"Hide\")","v":"Show"},"LGOP Equation 10.3 - Process CH4 from Anaerobic and Facultative Wastewater Treatment Lagoons (site-specific data)"]
[{"$f":"IF(AND(wwt_control_q2=TRUE, wwt_control_q5=TRUE), \"Show\", \"Hide\")","v":"Show"},"Measured BOD5 Load (kg BOD5/day)","× 1 - Measured BOD5 Percentage Removed","× Maximum CH4 Production Capacity (kg CH4/kg BOD5)","× Anaerobic CH4 Correction Factor","× day/yr","× MT/kg =","MT CH4","× GWP =","MT CO2e"]
[{"$f":"IF(AND(wwt_control_q2=TRUE, wwt_control_q5=TRUE), \"Show\", \"Hide\")","v":"Show"},{"$f":"wwt_entry_BODinput","v":0},{"$f":"1-wwt_entry_BODremoved","v":1},{"$f":"wwt_factors_MaxCapacity","v":0.6},{"$f":"wwt_factors_anaerobicCF","v":0.8},{"$f":"perday_peryr","v":365.25},{"$f":"kg_mt","v":1E-3},{"$f":"B33*C33*D33*E33*F33*G33","v":0},{"$f":"CH4_CO2e","v":21},{"$f":"IF(AND(wwt_control_q2=TRUE, wwt_control_q5=TRUE), H33*I33, 0)","v":0}]
[{"$f":"IF(AND(wwt_control_q2=TRUE, wwt_control_q5=TRUE), \"Show\", \"Hide\")","v":"Show"}]
[{"$f":"IF(AND(wwt_control_q2=TRUE, wwt_control_q5=TRUE), \"Show\", \"Hide\")","v":"Show"}]
[{"$f":"IF(AND(wwt_control_q2=TRUE, wwt_control_q5=FALSE), \"Show\", \"Hide\")","v":"Hide"},"LGOP Equation 10.4 - Process CH4 from Wastewater Treatment Lagoons (default data)"]
[{"$f":"IF(AND(wwt_control_q2=TRUE, wwt_control_q5=FALSE), \"Show\", \"Hide\")","v":"Hide"},"Effective Population Served by Lagoons","× Factor for Industrial Discharge into System","× Default BOD5 Load (kg BOD5/day)","× 1 - Default BOD5 Percentage Removed","× Maximum CH4 Production Capacity (kg CH4/kg BOD5)","× Anaerobic CH4 Correction Factor","× day/yr","× MT/kg =","MT CH4","× GWP =","MT CO2e"]
[{"$f":"IF(AND(wwt_control_q2=TRUE, wwt_control_q5=FALSE), \"Show\", \"Hide\")","v":"Hide"},{"$f":"IF(wwt_control_q7=TRUE, wwt_calcs_Peff_anaerobic, wwt_entry_popAnaerobic)","v":0},{"$f":"wwt_factors_FInd","v":1.25},{"$f":"wwt_factors_BOD5load_def","v":0.09},{"$f":"1-wwt_factors_Fp_def","v":0.67500000000000004},{"$f":"wwt_factors_MaxCapacity","v":0.6},{"$f":"wwt_factors_anaerobicCF","v":0.8},{"$f":"perday_peryr","v":365.25},{"$f":"kg_mt","v":1E-3},{"$f":"B38*C38*D38*E38*F38*G38*H38*I38","v":0},{"$f":"CH4_CO2e","v":21},{"$f":"IF(AND(wwt_control_q2=TRUE, wwt_control_q5=FALSE), J38*K38, 0)","v":0}]
[{"$f":"IF(AND(wwt_control_q2=TRUE, wwt_control_q5=FALSE), \"Show\", \"Hide\")","v":"Hide"}]
[{"$f":"IF(AND(wwt_control_q2=TRUE, wwt_control_q5=FALSE), \"Show\", \"Hide\")","v":"Hide"}]
[{"$f":"IF(wwt_control_q6=TRUE, \"Show\", \"Hide\")","v":"Show"},"LGOP Equation 10.6 - Fugitive CH4 Emissions from Septic Systems (default BOD5 load)"]
[{"$f":"IF(wwt_control_q6=TRUE, \"Show\", \"Hide\")","v":"Show"},"Population Served by Septic Systems","× Default BOD5 Load (kg BOD5/day)","× Maximum CH4 Production Capacity (kg CH4/kg BOD5)","× Septic CH4 Correction Factor","× day/yr","× MT/kg =","MT CH4","× GWP =","MT CO2e"]
[{"$f":"IF(wwt_control_q6=TRUE, \"Show\", \"Hide\")","v":"Show"},{"$f":"wwt_entry_popSeptic","v":0},{"$f":"wwt_factors_BOD5load_def","v":0.09},{"$f":"wwt_factors_MaxCapacity","v":0.6},{"$f":"wwt_factors_septicCF","v":0.5},{"$f":"perday_peryr","v":365.25},{"$f":"kg_mt","v":1E-3},{"$f":"B43*C43*D43*E43*F43*G43","v":0},{"$f":"CH4_CO2e","v":21},{"$f":"IF(wwt_control_q6=TRUE, H43*I43, 0)","v":0}]
[{"$f":"IF(wwt_control_q6=TRUE, \"Show\", \"Hide\")","v":"Show"}]
[{"$f":"IF(wwt_control_q6=TRUE, \"Show\", \"Hide\")","v":"Show"}]
[{"$f":"IF(wwt_control_q8=TRUE, \"Show\", \"Hide\")","v":"Show"},"LGOP Equation 10.7 - Process N2O Emissions from WWTP with Nitrification/Denitrification"]
[{"$f":"IF(wwt_control_q8=TRUE, \"Show\", \"Hide\")","v":"Show"},"Effective Population Served by Nit/Denit","× Factor for Industrial Discharge into System","× Nit/Denit Emissions Factor (g N2O/person/yr)","× MT/g =","MT N2O","× GWP =","MT CO2e"]
[{"$f":"IF(wwt_control_q8=TRUE, \"Show\", \"Hide\")","v":"Show"},{"$f":"IF(wwt_control_q7=TRUE, wwt_calcs_Peff_nit, wwt_entry_popNit)","v":0},{"$f":"wwt_factors_FInd","v":1.25},{"$f":"wwt_factors_EFnitdenit","v":7},{"$f":"g_MT","v":9.9999999999999995E-7},{"$f":"B48*C48*D48*E48","v":0},{"$f":"N2O_CO2e","v":310},{"$f":"IF(wwt_control_q8=TRUE, F48*G48, 0)","v":0}]
[{"$f":"IF(wwt_control_q8=TRUE, \"Show\", \"Hide\")","v":"Show"}]
[{"$f":"IF(wwt_control_q8=TRUE, \"Show\", \"Hide\")","v":"Show"}]
[{"$f":"IF(wwt_control_q9=TRUE, \"Show\", \"Hide\")","v":"Hide"},"LGOP Equation 10.8 - Process N2O Emissions from WWTP without Nitrification/Denitrification"]
[{"$f":"IF(wwt_control_q9=TRUE, \"Show\", \"Hide\")","v":"Hide"},"Effective Population Served without Nit/Denit","× Factor for Industrial Discharge into System","× No Nit/Denit Emissions Factor (g N2O/person/yr)","× MT/g =","MT N2O","× GWP =","MT CO2e"]
["Hide",{"$f":"IF(wwt_control_q7=TRUE, wwt_calcs_Peff_noNit, wwt_entry_popNoNit)","v":0},{"$f":"wwt_factors_FInd","v":1.25},{"$f":"wwt_factors_EFnoNit","v":3.2},{"$f":"g_MT","v":9.9999999999999995E-7},{"$f":"B53*C53*D53*E53","v":0},{"$f":"N2O_CO2e","v":310},{"$f":"IF(wwt_control_q9=TRUE,F53*G53,0)","v":0}]
["Hide"]
["Hide"]
[{"$f":"IF(wwt_control_q9=TRUE, \"Show\", \"Hide\")","v":"Hide"},"LGOP Equation 10.9 - Process N2O Emissions from Effluent Discharge (site-specific N load data)"]
["Hide","Measured Average Total N Discharged (kg N/day)","× Effluent Emission Factor (kg N2O-N/kg sewage)","× day/yr","× MT/kg","× N2O/N2 Molecular Weight Ratio = ","MT N2O","× GWP =","MT CO2e"]
["Hide",{"$f":"wwt_entry_Neffluent","v":0},{"$f":"wwt_factors_EFeff","v":5.0000000000000001E-3},{"$f":"perday_peryr","v":365.25},{"$f":"kg_mt","v":1E-3},{"$f":"wwt_factors_N2O_N2","v":1.5714285714285714},{"$f":"B58*C58*D58*E58*F58","v":0},{"$f":"N2O_CO2e","v":310},{"$f":"IF(wwt_control_q9=TRUE, G58*H58, 0)","v":0}]
["Hide"]
["Hide"]
[{"$f":"IF(wwt_control_q10=FALSE, \"Show\", \"Hide\")","v":"Show"},"LGOP Equation 10.10 - Process N2O Emissions from Effluent Discharge (default N load data)"]
[{"$f":"IF(wwt_control_q10=FALSE, \"Show\", \"Hide\")","v":"Show"},"Population Served","Factor for Industrial Discharge into System","× [Total N Load (kg N/person/day)","- N uptake* (kg N/kg BOD5)","× BOD5 Load ]","× Effluent Emissions Factor (kg N2O-N/kg sewage)","× N2O/N2 Molecular Weight Ratio","× 1 - Fraction of Nitrogen Removed**","× day/yr","× MT/kg =","MT N2O","× GWP =","MT CO2e"]
[{"$f":"IF(AND(wwt_control_q10=FALSE, wwt_control_q2=TRUE, wwt_control_q8=TRUE), \"Show\", \"Hide\")","v":"Show"},"Anaerobic Treatment with Nitrification/Denitrification"]
[{"$f":"IF(AND(wwt_control_q10=FALSE, wwt_control_q2=TRUE, wwt_control_q8=TRUE), \"Show\", \"Hide\")","v":"Show"},{"$f":"wwt_entry_popNit","v":0},{"$f":"wwt_factors_FInd","v":1.25},{"$f":"wwt_factors_NloadTot","v":2.5999999999999999E-2},{"$f":"wwt_factors_NupAnaerobic","v":5.0000000000000001E-3},{"$f":"wwt_factors_BOD5load_def","v":0.09},{"$f":"wwt_factors_EFeff","v":5.0000000000000001E-3},{"$f":"wwt_factors_N2O_N2","v":1.5714285714285714},{"$f":"1-wwt_factors_nitdenit_def","v":0.30000000000000004},{"$f":"perday_peryr","v":365.25},{"$f":"kg_mt","v":1E-3},{"$f":"B64*C64*(D64-E64*F64)*G64*H64*I64*J64*K64","v":0},{"$f":"N2O_CO2e","v":310},{"$f":"IF(AND(wwt_control_q10=FALSE, wwt_control_q2=TRUE, wwt_control_q8=TRUE), L64*M64, 0)","v":0}]
[{"$f":"IF(AND(wwt_control_q10=FALSE, wwt_control_q2=TRUE, wwt_control_q9=TRUE), \"Show\", \"Hide\")","v":"Hide"},"Anaerobic Treatment without Nitrification/Denitrification"]
[{"$f":"IF(AND(wwt_control_q10=FALSE, wwt_control_q2=TRUE, wwt_control_q9=TRUE), \"Show\", \"Hide\")","v":"Hide"},{"$f":"wwt_entry_popNoNit","v":0},{"$f":"wwt_factors_FInd","v":1.25},{"$f":"wwt_factors_NloadTot","v":2.5999999999999999E-2},{"$f":"wwt_factors_NupAnaerobic","v":5.0000000000000001E-3},{"$f":"wwt_factors_BOD5load_def","v":0.09},{"$f":"wwt_factors_EFeff","v":5.0000000000000001E-3},{"$f":"wwt_factors_N2O_N2","v":1.5714285714285714},{"$f":"1-wwt_factors_nonitdenit_def","v":1},{"$f":"perday_peryr","v":365.25},{"$f":"kg_mt","v":1E-3},{"$f":"B66*C66*(D66-E66*F66)*G66*H66*I66*J66*K66","v":0},{"$f":"N2O_CO2e","v":310},{"$f":"IF(AND(wwt_control_q10=FALSE, wwt_control_q2=TRUE, wwt_control_q9=TRUE), L66*M66, 0)","v":0}]
[{"$f":"IF(AND(wwt_control_q10=FALSE, wwt_control_q3=TRUE, wwt_control_q8=TRUE), \"Show\", \"Hide\")","v":"Show"},"Aerobic Treatment with Nitrification/Denitrification"]
[{"$f":"IF(AND(wwt_control_q10=FALSE, wwt_control_q3=TRUE, wwt_control_q8=TRUE), \"Show\", \"Hide\")","v":"Show"},{"$f":"wwt_entry_popNit","v":0},{"$f":"wwt_factors_FInd","v":1.25},{"$f":"wwt_factors_NloadTot","v":2.5999999999999999E-2},{"$f":"wwt_factors_NupAerobic","v":0.05},{"$f":"wwt_factors_BOD5load_def","v":0.09},{"$f":"wwt_factors_EFeff","v":5.0000000000000001E-3},{"$f":"wwt_factors_N2O_N2","v":1.5714285714285714},{"$f":"1-wwt_factors_nitdenit_def","v":0.30000000000000004},{"$f":"perday_peryr","v":365.25},{"$f":"kg_mt","v":1E-3},{"$f":"B68*C68*(D68-E68*F68)*G68*H68*I68*J68*K68","v":0},{"$f":"N2O_CO2e","v":310},{"$f":"IF(AND(wwt_control_q10=FALSE, wwt_control_q3=TRUE, wwt_control_q8=TRUE), L68*M68, 0)","v":0}]
[{"$f":"IF(AND(wwt_control_q10=FALSE, wwt_control_q3=TRUE, wwt_control_q9=TRUE), \"Show\", \"Hide\")","v":"Hide"},"Aerobic Treatment without Nitrification/Denitrification"]
[{"$f":"IF(AND(wwt_control_q10=FALSE, wwt_control_q3=TRUE, wwt_control_q9=TRUE), \"Show\", \"Hide\")","v":"Hide"},{"$f":"wwt_entry_popNoNit","v":0},{"$f":"wwt_factors_FInd","v":1.25},{"$f":"wwt_factors_NloadTot","v":2.5999999999999999E-2},{"$f":"wwt_factors_NupAerobic","v":0.05},{"$f":"wwt_factors_BOD5load_def","v":0.09},{"$f":"wwt_factors_EFeff","v":5.0000000000000001E-3},{"$f":"wwt_factors_N2O_N2","v":1.5714285714285714},{"$f":"1-wwt_factors_nonitdenit_def","v":1},{"$f":"perday_peryr","v":365.25},{"$f":"kg_mt","v":1E-3},{"$f":"B70*C70*(D70-E70*F70)*G70*H70*I70*J70*K70","v":0},{"$f":"N2O_CO2e","v":310},{"$f":"IF(AND(wwt_control_q10=FALSE, wwt_control_q3=TRUE, wwt_control_q9=TRUE), L70*M70, 0)","v":0}]
[{"$f":"IF(wwt_control_q10=FALSE, \"Show\", \"Hide\")","v":"Show"},"*Depends if anaerobic/aerobic; **Depends if with/without Nitrification/Denitrification"]
[{"$f":"IF(wwt_control_q9=FALSE, \"Show\", \"Hide\")","v":"Show"}]
[{"$f":"IF(wwt_control_q9=FALSE, \"Show\", \"Hide\")","v":"Show"}]
[{"$f":"IF(wwt_control_q7=TRUE, \"Show\", \"Hide\")","v":"Hide"},"Effective Population Calculations"]
[{"$f":"IF(wwt_control_q7=TRUE, \"Show\", \"Hide\")","v":"Hide"},"System","Industrial Load (lbs N/day)","× kg/lb","÷ Population Equivalency Factor (kg N/person/day)","= Population Equivalent of Industrial Loading","+ Population Served","= Effective Population"]
[{"$f":"IF(AND(wwt_control_q7=TRUE, wwt_control_q2=TRUE), \"Show\", \"Hide\")","v":"Hide"},"Anaerobic",{"$f":"wwt_entry_indusNload","v":0},{"$f":"lb_kg","v":0.45359237000000002},2.5999999999999999E-2,{"$f":"C76*D76/E76","v":0},{"$f":"wwt_entry_popAnaerobic","v":0},{"$f":"F76+G76","v":0}]
[{"$f":"IF(AND(wwt_control_q7=TRUE, wwt_control_q3=TRUE), \"Show\", \"Hide\")","v":"Hide"},"Aerobic",{"$f":"wwt_entry_indusNload","v":0},{"$f":"lb_kg","v":0.45359237000000002},2.5999999999999999E-2,{"$f":"C77*D77/E77","v":0},{"$f":"wwt_entry_popAerobic","v":0},{"$f":"F77+G77","v":0}]
[{"$f":"IF(AND(wwt_control_q7=TRUE, wwt_control_q8=TRUE), \"Show\", \"Hide\")","v":"Hide"},"Nit/Denit",{"$f":"wwt_entry_indusNload","v":0},{"$f":"lb_kg","v":0.45359237000000002},2.5999999999999999E-2,0,{"$f":"wwt_entry_popNit","v":0},0]
[{"$f":"IF(wwt_control_q7=TRUE, \"Show\", \"Hide\")","v":"Hide"},"No Nit/Denit",{"$f":"wwt_entry_indusNload","v":0},{"$f":"lb_kg","v":0.45359237000000002},2.5999999999999999E-2,0,{"$f":"wwt_entry_popNoNit","v":0},0]
[]
[]
[null,"Cell Color Codes"]
[null,"Data entered on previous sheet"]
[null,"Calculated or Entered Data"]
[null,"CH4 Emissions"]
[null,"N2O Emissions"]
[null,"Value depends on system type"]
[]
[]
["Tribal GHG Inventory Tool: Government Operations Module"]

{"sheet":"Electricity-Entry","index":21,"n_rows":22,"n_cols":6,"rows_kept":22,"cut":false,"hidden":false,"merged":[[21,0,21,5]]}
["Electricity Use - Entry"]
["Data Entry & Calculations"]
[]
[]
[]
[]
[]
["1)","Describe the electricity consuming unit you are entering"]
[null,"ID#","Unit Description","Facility Type (if applicable)","Department"]
[0,{"$f":"elec_CurrentID","v":1}]
[]
[]
["2)",{"$f":"\"Enter the activity data for the year \"&MyYear","v":"Enter the activity data for the year "}]
[]
[null,null,"Electricity Consumed (kWh)","Electric Utility"]
[null,null,null,"Select eGRID Subregion…"]
[]
[]
[null,null,null,null,null," "]
[]
[]
["Tribal GHG Inventory Tool: Government Operations Module"]

{"sheet":"Electricity-Data","index":22,"n_rows":8,"n_cols":6,"rows_kept":8,"cut":false,"hidden":false,"merged":[]}
["Electricity Use - Data"]
[]
[]
[]
["Linker Row"]
["ID#","Unit Description","Department","Utility","Electricity Consumed (kWh)","Facility Type"]
[{"$f":"MAX(A9:A65514)+1","v":1},{"$f":"elec_entry_description","v":0},{"$f":"elec_entry_dept","v":0},{"$f":"elec_entry_utility","v":"Select eGRID Subregion…"},{"$f":"elec_entry_consumption","v":0},{"$f":"elec_entry_bldgtype","v":0}]
["Saved Data"]

{"sheet":"Electricity-Calcs","index":23,"n_rows":240,"n_cols":9,"rows_kept":240,"cut":false,"hidden":false,"merged":[[17,1,17,5],[61,1,61,2],[239,0,239,12]]}
["Electricity Use - Calculation & Summary "]
["Jump to…"]
["GHG Summary"]
["Emissions by Department"]
["Electricity Summary"]
["Electricity Use by Department"]
["Background Calculations"]
["CO2 emissions by utility"]
["CH4 emissions by utility"]
["N2O emissions by utility"]
["Activity data by department and utility"]
["CO2 emissions by department and utility"]
["CH4 emissions by department and utility"]
["N2O emissions by department and utility"]
[]
["GHG Summary"]
[]
[null,"Emissions by Department (in CO2e)"]
[null,null,"CO2","CH4","N2O","Total"]
["Dstart",{"$f":"'Background Controls'!I5","v":0},{"$f":"IF(ISNA(VLOOKUP($B20, elec_calcs_deptCO2, 8, FALSE)),0, VLOOKUP($B20, elec_calcs_deptCO2, 8, FALSE))","v":0},{"$f":"IF(ISNA(VLOOKUP($B20, elec_calcs_deptCH4, 8, FALSE)),0, VLOOKUP($B20, elec_calcs_deptCH4, 8, FALSE))","v":0},{"$f":"IF(ISNA(VLOOKUP($B20, elec_calcs_deptN2O, 8, FALSE)),0, VLOOKUP($B20, elec_calcs_deptN2O, 8, FALSE))","v":0},{"$f":"SUM(C20:E20)","v":0}]
[null,{"$f":"'Background Controls'!I6","v":0},0,0,0,{"$f":"SUM(C21:E21)","v":0}]
[null,{"$f":"'Background Controls'!I7","v":0},0,0,0,0]
[null,{"$f":"'Background Controls'!I8","v":0},0,0,0,0]
[null,{"$f":"'Background Controls'!I9","v":0},0,0,0,0]
[null,{"$f":"'Background Controls'!I10","v":0},0,0,0,0]
[null,{"$f":"'Background Controls'!I11","v":0},0,0,0,0]
[null,{"$f":"'Background Controls'!I12","v":0},0,0,0,0]
[null,{"$f":"'Background Controls'!I13","v":0},0,0,0,0]
[null,{"$f":"'Background Controls'!I14","v":0},0,0,0,0]
[null,{"$f":"'Background Controls'!I15","v":0},0,0,0,0]
[null,{"$f":"'Background Controls'!I16","v":0},0,0,0,0]
[null,{"$f":"'Background Controls'!I17","v":0},0,0,0,0]
[null,{"$f":"'Background Controls'!I18","v":0},0,0,0,0]
[null,{"$f":"'Background Controls'!I19","v":0},0,0,0,0]
[null,{"$f":"'Background Controls'!I20","v":0},0,0,0,0]
[null,{"$f":"'Background Controls'!I21","v":0},0,0,0,0]
[null,{"$f":"'Background Controls'!I22","v":0},0,0,0,0]
[null,{"$f":"'Background Controls'!I23","v":0},0,0,0,0]
[null,{"$f":"'Background Controls'!I24","v":0},0,0,0,0]
[null,"Total Emissions from Electricity Use",{"$f":"SUM(C20:C29)","v":0},{"$f":"SUM(D20:D29)","v":0},0,0]
[]
[]
[]
[]
[]
[]
[]
[]
[]
[]
[]
[]
[]
[]
[]
[]
[]
[]
[]
["Electricity Summary"]
[]
[null,"Electricity Use by Department (in kWh)"]
[null,"Department","kWh"]
["Dstart",{"$f":"'Background Controls'!I5","v":0},{"$f":"SUMIF(elec_data_dept, B64, elec_data_consump)","v":0}]
[null,{"$f":"'Background Controls'!I6","v":0},0]
[null,{"$f":"'Background Controls'!I7","v":0},0]
[null,{"$f":"'Background Controls'!I8","v":0},0]
[null,{"$f":"'Background Controls'!I9","v":0},0]
[null,{"$f":"'Background Controls'!I10","v":0},0]
[null,{"$f":"'Background Controls'!I11","v":0},0]
[null,{"$f":"'Background Controls'!I12","v":0},0]
[null,{"$f":"'Background Controls'!I13","v":0},0]
[null,{"$f":"'Background Controls'!I14","v":0},0]
[null,{"$f":"'Background Controls'!I15","v":0},0]
[null,{"$f":"'Background Controls'!I16","v":0},0]
[null,{"$f":"'Background Controls'!I17","v":0},0]
[null,{"$f":"'Background Controls'!I18","v":0},0]
[null,{"$f":"'Background Controls'!I19","v":0},0]
[null,{"$f":"'Background Controls'!I20","v":0},0]
[null,{"$f":"'Background Controls'!I21","v":0},0]
[null,{"$f":"'Background Controls'!I22","v":0},0]
[null,{"$f":"'Background Controls'!I23","v":0},0]
[null,{"$f":"'Background Controls'!I24","v":0},0]
[null,"Total Electricity Use",{"$f":"SUM(C64:C83)","v":0}]
[]
[]
[]
[]
[]
[]
[]
[]
[]
[]
[]
[]
[]
[]
[]
[]
[]
[]
[]
[]
[]
["Background Calculations"]
[]
["CO2 Emissions by Utility"]
["Emissions = Electricity Consumed (kWh) × Utility Emissions Factor (lb CO2/MWh) × MWh/kWh × MT/lb × CO2 GWP"]
[null,"Utility","kWh","Utility EF (lb CO2/MWh)","MWh/kWh","MT/lb","MT CO2","× GWP =","MT CO2e"]
[null,{"$f":"IF('Background Controls'!$B$62=0,\"-\",'Background Controls'!$B$62)","v":"-"},{"$f":"SUMIF(elec_data_utility, B111, elec_data_consump)","v":0},{"$f":"IFERROR(VLOOKUP(B111, elec_control_factors, 2, FALSE),\"-\")","v":"-"},{"$f":"kWh_MWh","v":1E-3},{"$f":"lb_mt","v":4.5359236999999999E-4},{"$f":"IFERROR(C111*D111*E111*F111,\"-\")","v":"-"},{"$f":"CO2_CO2e","v":1},{"$f":"IFERROR(G111*H111,\"-\")","v":"-"}]
[null,{"$f":"IF('Background Controls'!$B$63=0,\"-\",'Background Controls'!$B$63)","v":"-"},0,"-",1E-3,4.5359236999999999E-4,{"$f":"IFERROR(C112*D112*E112*F112,\"-\")","v":"-"},1,{"$f":"IFERROR(G112*H112,\"-\")","v":"-"}]
[null,{"$f":"IF('Background Controls'!$B$64=0,\"-\",'Background Controls'!$B$64)","v":"-"},0,"-",1E-3,4.5359236999999999E-4,"-",1,"-"]
[null,{"$f":"IF('Background Controls'!$B$65=0,\"-\",'Background Controls'!$B$65)","v":"-"},0,"-",1E-3,4.5359236999999999E-4,"-",1,"-"]
[null,{"$f":"IF('Background Controls'!$B$66=0,\"-\",'Background Controls'!$B$66)","v":"-"},0,"-",1E-3,4.5359236999999999E-4,"-",1,"-"]
[null,{"$f":"IF('Background Controls'!$B$67=0,\"-\",'Background Controls'!$B$67)","v":"-"},0,"-",1E-3,4.5359236999999999E-4,"-",1,"-"]
[]
["CH4 Emissions by Utility"]
["Emissions = Electricity Consumed (kWh) × Utility Emissions Factor (lb CH4/MWh) × MWh/kWh × MT/lb × CH4 GWP"]
[null,"Utility","kWh","Utility EF (lb CH4/MWh)","MWh/kWh","MT/lb","MT CH4","× GWP =","MT CO2e"]
[null,{"$f":"IF('Background Controls'!$B$62=0,\"-\",'Background Controls'!$B$62)","v":"-"},{"$f":"SUMIF(elec_data_utility, B121, elec_data_consump)","v":0},{"$f":"IFERROR(VLOOKUP(B121, elec_control_factors, 3, FALSE),\"-\")","v":"-"},{"$f":"kWh_MWh","v":1E-3},{"$f":"lb_mt","v":4.5359236999999999E-4},{"$f":"IFERROR(C121*D121*E121*F121,\"-\")","v":"-"},{"$f":"CH4_CO2e","v":21},{"$f":"IFERROR(G121*H121,\"-\")","v":"-"}]
[null,{"$f":"IF('Background Controls'!$B$63=0,\"-\",'Background Controls'!$B$63)","v":"-"},0,"-",1E-3,4.5359236999999999E-4,{"$f":"IFERROR(C122*D122*E122*F122,\"-\")","v":"-"},21,{"$f":"IFERROR(G122*H122,\"-\")","v":"-"}]
[null,{"$f":"IF('Background Controls'!$B$64=0,\"-\",'Background Controls'!$B$64)","v":"-"},0,"-",1E-3,4.5359236999999999E-4,"-",21,"-"]
[null,{"$f":"IF('Background Controls'!$B$65=0,\"-\",'Background Controls'!$B$65)","v":"-"},0,"-",1E-3,4.5359236999999999E-4,"-",21,"-"]
[null,{"$f":"IF('Background Controls'!$B$66=0,\"-\",'Background Controls'!$B$66)","v":"-"},0,"-",1E-3,4.5359236999999999E-4,"-",21,"-"]
[null,{"$f":"IF('Background Controls'!$B$67=0,\"-\",'Background Controls'!$B$67)","v":"-"},{"$f":"SUMIF(elec_data_utility, B126, elec_data_consump)","v":0},"-",1E-3,4.5359236999999999E-4,"-",21,"-"]
[]
["N2O Emissions by Utility"]
["Emissions = Electricity Consumed (kWh) × Utility Emissions Factor (lb N2O/MWh) × MWh/kWh × MT/lb × N2O GWP"]
[null,"Utility","kWh","Utility EF (lb N2O/MWh)","MWh/kWh","MT/lb","MT N2O","× GWP =","MT CO2e"]
[null,{"$f":"IF('Background Controls'!$B$62=0,\"-\",'Background Controls'!$B$62)","v":"-"},{"$f":"SUMIF(elec_data_utility, B131, elec_data_consump)","v":0},{"$f":"IFERROR(VLOOKUP(B131, elec_control_factors, 4, FALSE),\"-\")","v":"-"},{"$f":"kWh_MWh","v":1E-3},{"$f":"lb_mt","v":4.5359236999999999E-4},{"$f":"IFERROR(C131*D131*E131*F131,\"-\")","v":"-"},{"$f":"N2O_CO2e","v":310},{"$f":"IFERROR(G131*H131,\"-\")","v":"-"}]
[null,{"$f":"IF('Background Controls'!$B$63=0,\"-\",'Background Controls'!$B$63)","v":"-"},0,"-",1E-3,4.5359236999999999E-4,{"$f":"IFERROR(C132*D132*E132*F132,\"-\")","v":"-"},310,{"$f":"IFERROR(G132*H132,\"-\")","v":"-"}]
[null,{"$f":"IF('Background Controls'!$B$64=0,\"-\",'Background Controls'!$B$64)","v":"-"},0,"-",1E-3,4.5359236999999999E-4,"-",310,"-"]
[null,{"$f":"IF('Background Controls'!$B$65=0,\"-\",'Background Controls'!$B$65)","v":"-"},0,"-",1E-3,4.5359236999999999E-4,"-",310,"-"]
[null,{"$f":"IF('Background Controls'!$B$66=0,\"-\",'Background Controls'!$B$66)","v":"-"},0,"-",1E-3,4.5359236999999999E-4,"-",310,"-"]
[null,{"$f":"IF('Background Controls'!$B$67=0,\"-\",'Background Controls'!$B$67)","v":"-"},{"$f":"SUMIF(elec_data_utility, B136, elec_data_consump)","v":0},"-",1E-3,4.5359236999999999E-4,"-",310,"-"]
[]
["Activity Data by Department and Utility"]
["Electricity use data by department and fuel type (kWh)"]
[null,"Department",{"$f":"IF('Background Controls'!$B$62=0,\"-\",'Background Controls'!$B$62)","v":"-"},{"$f":"IF('Background Controls'!$B$63=0,\"-\",'Background Controls'!$B$63)","v":"-"},{"$f":"IF('Background Controls'!$B$64=0,\"-\",'Background Controls'!$B$64)","v":"-"},{"$f":"IF('Background Controls'!$B$65=0,\"-\",'Background Controls'!$B$65)","v":"-"},{"$f":"IF('Background Controls'!$B$66=0,\"-\",'Background Controls'!$B$66)","v":"-"},{"$f":"IF('Background Controls'!$B$67=0,\"-\",'Background Controls'!$B$67)","v":"-"},"TOTAL"]
["Dstart",{"$f":"'Background Controls'!I5","v":0},{"$f":"SUMIFS(elec_data_consump, elec_data_dept, $B141, elec_data_utility, C$140)","v":0},0,0,0,0,0,{"$f":"SUM(C141:H141)","v":0}]
[null,{"$f":"'Background Controls'!I6","v":0},0,0,0,0,0,0,0]
[null,{"$f":"'Background Controls'!I7","v":0},0,0,0,0,0,0,0]
[null,{"$f":"'Background Controls'!I8","v":0},0,0,0,0,0,0,0]
[null,{"$f":"'Background Controls'!I9","v":0},0,0,0,0,0,0,0]
[null,{"$f":"'Background Controls'!I10","v":0},0,0,0,0,0,0,0]
[null,{"$f":"'Background Controls'!I11","v":0},0,0,0,0,0,0,0]
[null,{"$f":"'Background Controls'!I12","v":0},0,0,0,0,0,0,0]
[null,{"$f":"'Background Controls'!I13","v":0},0,0,0,0,0,0,0]
[null,{"$f":"'Background Controls'!I14","v":0},0,0,0,0,0,0,0]
[null,{"$f":"'Background Controls'!I15","v":0},{"$f":"SUMIFS(elec_data_consump, elec_data_dept, $B151, elec_data_utility, C$140)","v":0},0,0,0,0,0,0]
[null,{"$f":"'Background Controls'!I16","v":0},0,0,0,0,0,0,0]
[null,{"$f":"'Background Controls'!I17","v":0},0,0,0,0,0,0,0]
[null,{"$f":"'Background Controls'!I18","v":0},0,0,0,0,0,0,0]
[null,{"$f":"'Background Controls'!I19","v":0},0,0,0,0,0,0,0]
[null,{"$f":"'Background Controls'!I20","v":0},0,0,0,0,0,0,0]
[null,{"$f":"'Background Controls'!I21","v":0},{"$f":"SUMIFS(elec_data_consump, elec_data_dept, $B157, elec_data_utility, C$140)","v":0},0,0,0,0,0,0]
[null,{"$f":"'Background Controls'!I22","v":0},0,0,0,0,0,0,0]
[null,{"$f":"'Background Controls'!I23","v":0},0,0,0,0,0,0,0]
[null,{"$f":"'Background Controls'!I24","v":0},0,0,0,0,0,0,0]
[null,"Total",{"$f":"SUM(C141:C160)","v":0},0,0,0,0,0,{"$f":"SUM(I141:I160)","v":0}]
[]
["CO2 Emissions by Department and Utility"]
["Emissions = Electricity Consumed (kWh) × Utility Emissions Factor (lb CO2/MWh) × MWh/kWh × MT/lb × CO2 GWP"]
[null,"Department",{"$f":"IF('Background Controls'!$B$62=0,\"-\",'Background Controls'!$B$62)","v":"-"},{"$f":"IF('Background Controls'!$B$63=0,\"-\",'Background Controls'!$B$63)","v":"-"},{"$f":"IF('Background Controls'!$B$64=0,\"-\",'Background Controls'!$B$64)","v":"-"},{"$f":"IF('Background Controls'!$B$65=0,\"-\",'Background Controls'!$B$65)","v":"-"},{"$f":"IF('Background Controls'!$B$66=0,\"-\",'Background Controls'!$B$66)","v":"-"},{"$f":"IF('Background Controls'!$B$67=0,\"-\",'Background Controls'!$B$67)","v":"-"},"TOTAL"]
["Dstart",{"$f":"'Background Controls'!I5","v":0},{"$f":"IFERROR(C141*VLOOKUP(C$165, elec_control_factors, 2, FALSE)*kWh_MWh*lb_mt*CO2_CO2e,\"-\")","v":"-"},"-","-","-","-","-",{"$f":"SUM(C166:H166)","v":0}]
[null,{"$f":"'Background Controls'!I6","v":0},"-","-","-","-","-","-",0]
[null,{"$f":"'Background Controls'!I7","v":0},"-","-","-","-","-","-",0]
[null,{"$f":"'Background Controls'!I8","v":0},"-","-","-","-","-","-",0]
[null,{"$f":"'Background Controls'!I9","v":0},"-","-","-","-","-","-",0]
[null,{"$f":"'Background Controls'!I10","v":0},"-","-","-","-","-","-",0]
[null,{"$f":"'Background Controls'!I11","v":0},"-","-","-","-","-","-",0]
[null,{"$f":"'Background Controls'!I12","v":0},"-","-","-","-","-","-",0]
[null,{"$f":"'Background Controls'!I13","v":0},"-","-","-","-","-","-",0]
[null,{"$f":"'Background Controls'!I14","v":0},"-","-","-","-","-","-",0]
[null,{"$f":"'Background Controls'!I15","v":0},{"$f":"IFERROR(C151*VLOOKUP(C$165, elec_control_factors, 2, FALSE)*kWh_MWh*lb_mt*CO2_CO2e,\"-\")","v":"-"},"-","-","-","-","-",0]
[null,{"$f":"'Background Controls'!I16","v":0},"-","-","-","-","-","-",0]
[null,{"$f":"'Background Controls'!I17","v":0},"-","-","-","-","-","-",0]
[null,{"$f":"'Background Controls'!I18","v":0},"-","-","-","-","-","-",0]
[null,{"$f":"'Background Controls'!I19","v":0},"-","-","-","-","-","-",0]
[null,{"$f":"'Background Controls'!I20","v":0},"-","-","-","-","-","-",0]
[null,{"$f":"'Background Controls'!I21","v":0},"-","-","-","-","-","-",0]
[null,{"$f":"'Background Controls'!I22","v":0},"-","-","-","-","-","-",0]
[null,{"$f":"'Background Controls'!I23","v":0},"-","-","-","-","-","-",0]
[null,{"$f":"'Background Controls'!I24","v":0},"-","-","-","-","-","-",0]
[null,"Total",{"$f":"SUM(C166:C185)","v":0},0,0,0,0,0,{"$f":"SUM(I166:I185)","v":0}]
[]
["CH4 emissions by department and utility"]
["Emissions = Electricity Consumed (kWh) × Utility Emissions Factor (lb CH4/kWh) × MWh/kWh × MT/lb × CH4 GWP"]
[null,"Department",{"$f":"IF('Background Controls'!$B$62=0,\"-\",'Background Controls'!$B$62)","v":"-"},{"$f":"IF('Background Controls'!$B$63=0,\"-\",'Background Controls'!$B$63)","v":"-"},{"$f":"IF('Background Controls'!$B$64=0,\"-\",'Background Controls'!$B$64)","v":"-"},{"$f":"IF('Background Controls'!$B$65=0,\"-\",'Background Controls'!$B$65)","v":"-"},{"$f":"IF('Background Controls'!$B$66=0,\"-\",'Background Controls'!$B$66)","v":"-"},{"$f":"IF('Background Controls'!$B$67=0,\"-\",'Background Controls'!$B$67)","v":"-"},"TOTAL"]
["Dstart",{"$f":"'Background Controls'!I5","v":0},{"$f":"IFERROR(C141*VLOOKUP(C$165, elec_control_factors,3, FALSE)*kWh_MWh*lb_mt*CH4_CO2e,\"-\")","v":"-"},"-","-","-","-","-",{"$f":"SUM(C191:H191)","v":0}]
[null,{"$f":"'Background Controls'!I6","v":0},"-","-","-","-","-","-",0]
[null,{"$f":"'Background Controls'!I7","v":0},"-","-","-","-","-","-",0]
[null,{"$f":"'Background Controls'!I8","v":0},"-","-","-","-","-","-",0]
[null,{"$f":"'Background Controls'!I9","v":0},"-","-","-","-","-","-",0]
[null,{"$f":"'Background Controls'!I10","v":0},"-","-","-","-","-","-",0]
[null,{"$f":"'Background Controls'!I11","v":0},"-","-","-","-","-","-",0]
[null,{"$f":"'Background Controls'!I12","v":0},"-","-","-","-","-","-",0]
[null,{"$f":"'Background Controls'!I13","v":0},"-","-","-","-","-","-",0]
[null,{"$f":"'Background Controls'!I14","v":0},"-","-","-","-","-","-",0]
[null,{"$f":"'Background Controls'!I15","v":0},{"$f":"IFERROR(C151*VLOOKUP(C$165, elec_control_factors,3, FALSE)*kWh_MWh*lb_mt*CH4_CO2e,\"-\")","v":"-"},"-","-","-","-","-",0]
[null,{"$f":"'Background Controls'!I16","v":0},"-","-","-","-","-","-",0]
[null,{"$f":"'Background Controls'!I17","v":0},"-","-","-","-","-","-",0]
[null,{"$f":"'Background Controls'!I18","v":0},"-","-","-","-","-","-",0]
[null,{"$f":"'Background Controls'!I19","v":0},"-","-","-","-","-","-",0]
[null,{"$f":"'Background Controls'!I20","v":0},"-","-","-","-","-","-",0]
[null,{"$f":"'Background Controls'!I21","v":0},"-","-","-","-","-","-",0]
[null,{"$f":"'Background Controls'!I22","v":0},"-","-","-","-","-","-",0]
[null,{"$f":"'Background Controls'!I23","v":0},"-","-","-","-","-","-",0]
[null,{"$f":"'Background Controls'!I24","v":0},"-","-","-","-","-","-",0]
[null,"Total",{"$f":"SUM(C191:C210)","v":0},0,0,0,0,0,{"$f":"SUM(I191:I210)","v":0}]
[]
["N2O emissions by department and utility"]
["Emissions = Electricity Consumed (kWh) × Utility Emissions Factor (lb N2O/kWh) × MWh/kWh × MT/lb × N2O GWP"]
[null,"Department",{"$f":"IF('Background Controls'!$B$62=0,\"-\",'Background Controls'!$B$62)","v":"-"},{"$f":"IF('Background Controls'!$B$63=0,\"-\",'Background Controls'!$B$63)","v":"-"},{"$f":"IF('Background Controls'!$B$64=0,\"-\",'Background Controls'!$B$64)","v":"-"},{"$f":"IF('Background Controls'!$B$65=0,\"-\",'Background Controls'!$B$65)","v":"-"},{"$f":"IF('Background Controls'!$B$66=0,\"-\",'Background Controls'!$B$66)","v":"-"},{"$f":"IF('Background Controls'!$B$67=0,\"-\",'Background Controls'!$B$67)","v":"-"},"TOTAL"]
["Dstart",{"$f":"'Background Controls'!I5","v":0},{"$f":"IFERROR(C141*VLOOKUP(C$165, elec_control_factors,4, FALSE)*kWh_MWh*lb_mt*N2O_CO2e,\"-\")","v":"-"},"-","-","-","-","-",{"$f":"SUM(C216:H216)","v":0}]
[null,{"$f":"'Background Controls'!I6","v":0},"-","-","-","-","-","-",0]
[null,{"$f":"'Background Controls'!I7","v":0},"-","-","-","-","-","-",0]
[null,{"$f":"'Background Controls'!I8","v":0},"-","-","-","-","-","-",0]
[null,{"$f":"'Background Controls'!I9","v":0},"-","-","-","-","-","-",0]
[null,{"$f":"'Background Controls'!I10","v":0},"-","-","-","-","-","-",0]
[null,{"$f":"'Background Controls'!I11","v":0},"-","-","-","-","-","-",0]
[null,{"$f":"'Background Controls'!I12","v":0},"-","-","-","-","-","-",0]
[null,{"$f":"'Background Controls'!I13","v":0},"-","-","-","-","-","-",0]
[null,{"$f":"'Background Controls'!I14","v":0},"-","-","-","-","-","-",0]
[null,{"$f":"'Background Controls'!I15","v":0},{"$f":"IFERROR(C151*VLOOKUP(C$165, elec_control_factors,4, FALSE)*kWh_MWh*lb_mt*N2O_CO2e,\"-\")","v":"-"},"-","-","-","-","-",0]
[null,{"$f":"'Background Controls'!I16","v":0},"-","-","-","-","-","-",0]
[null,{"$f":"'Background Controls'!I17","v":0},"-","-","-","-","-","-",0]
[null,{"$f":"'Background Controls'!I18","v":0},"-","-","-","-","-","-",0]
[null,{"$f":"'Background Controls'!I19","v":0},"-","-","-","-","-","-",0]
[null,{"$f":"'Background Controls'!I20","v":0},"-","-","-","-","-","-",0]
[null,{"$f":"'Background Controls'!I21","v":0},"-","-","-","-","-","-",0]
[null,{"$f":"'Background Controls'!I22","v":0},"-","-","-","-","-","-",0]
[null,{"$f":"'Background Controls'!I23","v":0},"-","-","-","-","-","-",0]
[null,{"$f":"'Background Controls'!I24","v":0},"-","-","-","-","-","-",0]
[null,"Total",{"$f":"SUM(C216:C235)","v":0},0,0,0,0,0,{"$f":"SUM(I216:I235)","v":0}]
[]
[]
[]
["Tribal GHG Inventory Tool: Government Operations Module"]

{"sheet":"Employee Commute","index":24,"n_rows":188,"n_cols":11,"rows_kept":188,"cut":false,"hidden":false,"merged":[[187,0,187,13],[52,4,52,12],[60,1,60,2],[37,0,38,12],[54,0,55,12],[133,0,133,13],[50,0,50,13]]}
["Employee Commute"]
["Jump to…"]
["Step 1. Enter employee data by department"]
["Step 2. Enter mode of transportation proportions"]
["Employee Commute Emissions Summary"]
["Chart: Employee Commute Emissions"]
["Background Calculations"]
[]
[]
[]
[]
["1. Enter Employee Data"]
["Please enter the number of employees in each department. This will be used to calculate the commute emissions per department."]
[null,"Department","Number of employees"]
["Dstart",{"$f":"'Background Controls'!I5","v":0}]
[null,{"$f":"'Background Controls'!I6","v":0}]
[null,{"$f":"'Background Controls'!I7","v":0}]
[null,{"$f":"'Background Controls'!I8","v":0}]
[null,{"$f":"'Background Controls'!I9","v":0}]
[null,{"$f":"'Background Controls'!I10","v":0}]
[null,{"$f":"'Background Controls'!I11","v":0}]
[null,{"$f":"'Background Controls'!I12","v":0}]
[null,{"$f":"'Background Controls'!I13","v":0}]
[null,{"$f":"'Background Controls'!I14","v":0}]
[null,{"$f":"'Background Controls'!I15","v":0}]
[null,{"$f":"'Background Controls'!I16","v":0}]
[null,{"$f":"'Background Controls'!I17","v":0}]
[null,{"$f":"'Background Controls'!I18","v":0}]
[null,{"$f":"'Background Controls'!I19","v":0}]
[null,{"$f":"'Background Controls'!I20","v":0}]
[null,{"$f":"'Background Controls'!I21","v":0}]
[null,{"$f":"'Background Controls'!I22","v":0}]
[null,{"$f":"'Background Controls'!I23","v":0}]
[null,{"$f":"'Background Controls'!I24","v":0}]
[]
["2. Enter mode of transit proportions, commute length, and work days"]
["Please enter what percentage of employees use each form of transportation to work. These values will be used to determine how many employees travel by each mode every day. "]
["Default values are from the American Communities Survey, and represent the average distribution of transit modes in the United States. For more accurate emissions estimates, use proportions gathered from a travel survey of employees."]
[]
[null,"Mode","Employees who use mode (%)","Default Values"]
[null,"Single Occupancy Vehicle",null,0.76400000000000001]
[null,"Carpool",null,9.7000000000000003E-2]
[null,"Motorcycle",null,2E-3]
[null,"Transit",null,0.05]
[null,"Bike",null,6.0000000000000001E-3]
[null,"Walk",null,2.8000000000000001E-2]
[null,"Work at home",null,4.2999999999999997E-2]
[null,"Other",null,{"$f":"1-SUM(D41:D47)","v":9.9999999999998979E-3}]
[null,"Total",{"$f":"SUM(C41:C48)","v":0}]
[]
["Please enter the average one-way commute length for employees. Default commute distance is 12.6 miles (from FHWA's 2010 Status of the Nation's Highways Bridges and Transit, http://www.fhwa.dot.gov/policy/2010cpr/execsum.htm). "]
["This commute distance may be longer or shorter than the average commute for your employees. For the most accurate emissions estimates, use data from a travel survey of employees."]
[null,"Average One-Way Commute Length (miles)",null,12.6]
[]
["Please enter the number of days each employee works per year. This number will be multiplied by the emissions from daily commutes. Default work-year days is provided (240 days), assuming a 5-day work week, two weeks (10 days) of vacation, and 10 federal holidays."]
[]
[null,"Workdays per year",null,240]
[]
["Employee Commute Emissions Summary"]
[]
[null,"Emissions by Department (MT CO2e)"]
[null,null,"CO2"]
["Dstart",{"$f":"'Background Controls'!I5","v":0},{"$f":"IF(ISERROR(K164),0,K164)","v":0}]
[null,{"$f":"'Background Controls'!I6","v":0},{"$f":"IF(ISERROR(K165),0,K165)","v":0}]
[null,{"$f":"'Background Controls'!I7","v":0},0]
[null,{"$f":"'Background Controls'!I8","v":0},0]
[null,{"$f":"'Background Controls'!I9","v":0},0]
[null,{"$f":"'Background Controls'!I10","v":0},0]
[null,{"$f":"'Background Controls'!I11","v":0},0]
[null,{"$f":"'Background Controls'!I12","v":0},0]
[null,{"$f":"'Background Controls'!I13","v":0},0]
[null,{"$f":"'Background Controls'!I14","v":0},0]
[null,{"$f":"'Background Controls'!I15","v":0},0]
[null,{"$f":"'Background Controls'!I16","v":0},0]
[null,{"$f":"'Background Controls'!I17","v":0},0]
[null,{"$f":"'Background Controls'!I18","v":0},0]
[null,{"$f":"'Background Controls'!I19","v":0},0]
[null,{"$f":"'Background Controls'!I20","v":0},0]
[null,{"$f":"'Background Controls'!I21","v":0},0]
[null,{"$f":"'Background Controls'!I22","v":0},0]
[null,{"$f":"'Background Controls'!I23","v":0},0]
[null,{"$f":"'Background Controls'!I24","v":0},0]
[null,"Total",{"$f":"SUM(C63:C82)","v":0}]
[]
[]
[]
[]
[]
[]
[]
[]
[]
[]
[]
[]
[]
[]
[]
[]
[]
[]
[]
[]
[]
[]
["Background Calculations"]
[]
["Employees by Department and Mode"]
["Number of Employees who use mode = # of employees × percentage of employees who use each mode"]
[null,null,"Single Occupancy Vehicle","Carpool","Motorcycle","Transit","Bike","Walk","Work at Home","Other"]
["Dstart",{"$f":"'Background Controls'!I5","v":0},{"$f":"VLOOKUP(C$110,$B$41:$C$48, 2, FALSE)*VLOOKUP($B111, $B$15:$C$34, 2, FALSE)","v":0},{"$f":"VLOOKUP(D$110,$B$41:$C$48, 2, FALSE)*VLOOKUP($B111, $B$15:$C$34, 2, FALSE)","v":0},0,0,0,0,0,0]
[null,{"$f":"'Background Controls'!I6","v":0},0,0,0,0,0,0,0,0]
[null,{"$f":"'Background Controls'!I7","v":0},0,0,0,0,0,0,0,0]
[null,{"$f":"'Background Controls'!I8","v":0},0,0,0,0,0,0,0,0]
[null,{"$f":"'Background Controls'!I9","v":0},0,0,0,0,0,0,0,0]
[null,{"$f":"'Background Controls'!I10","v":0},0,0,0,0,0,0,0,0]
[null,{"$f":"'Background Controls'!I11","v":0},0,0,0,0,0,0,0,0]
[null,{"$f":"'Background Controls'!I12","v":0},0,0,0,0,0,0,0,0]
[null,{"$f":"'Background Controls'!I13","v":0},0,0,0,0,0,0,0,0]
[null,{"$f":"'Background Controls'!I14","v":0},0,0,0,0,0,0,0,0]
[null,{"$f":"'Background Controls'!I15","v":0},{"$f":"VLOOKUP(C$110,$B$41:$C$48, 2, FALSE)*VLOOKUP($B121, $B$15:$C$34, 2, FALSE)","v":0},0,0,0,0,0,0,0]
[null,{"$f":"'Background Controls'!I16","v":0},0,0,0,0,0,0,0,0]
[null,{"$f":"'Background Controls'!I17","v":0},0,0,0,0,0,0,0,0]
[null,{"$f":"'Background Controls'!I18","v":0},0,0,0,0,0,0,0,0]
[null,{"$f":"'Background Controls'!I19","v":0},0,0,0,0,0,0,0,0]
[null,{"$f":"'Background Controls'!I20","v":0},0,0,0,0,0,0,0,0]
[null,{"$f":"'Background Controls'!I21","v":0},0,0,0,0,0,0,0,0]
[null,{"$f":"'Background Controls'!I22","v":0},0,0,0,0,0,0,0,0]
[null,{"$f":"'Background Controls'!I23","v":0},0,0,0,0,0,0,0,0]
[null,{"$f":"'Background Controls'!I24","v":0},0,0,0,0,0,0,0,0]
[null,"Total",{"$f":"SUM(C111:C130)","v":0},{"$f":"SUM(D111:D130)","v":0},0,0,0,0,0,0]
[]
["Daily CO2 Emissions by Department and Mode"]
["CO2 Emissions/Day = Employees traveling × Trip Distance/day ÷ People/Mode ÷ miles per gallon × Mode Emissions Factor (kg CO2/gallon) × MT/kg × GWP CO2  [people × (1/people) × miles/day \n                                            × gal/mile × kg CO2/gal × MT/kg = MT CO2/day]"]
[null,null,"Single Occupancy Vehicle","Carpool","Motorcycle","Transit","Bike","Walk","Work at Home","Other","TOTAL"]
[null,"CO2 Emission Factor (kg/gal)",{"$f":"VLOOKUP(C135, commute_factors, 4, FALSE)","v":8.7799999999999994},8.7799999999999994,8.7799999999999994,{"$f":"VLOOKUP(F135, commute_factors, 4, FALSE)","v":0},0,0,0,0]
[null,"mpg",{"$f":"VLOOKUP(C$135, commute_factors, 2, FALSE)","v":21.6},{"$f":"VLOOKUP(D$135, commute_factors, 2, FALSE)","v":21.6},{"$f":"VLOOKUP(E$135, commute_factors, 2, FALSE)","v":43.4},0,0,0,0,0]
[null,"People/Mode",{"$f":"VLOOKUP(C135, commute_factors, 3, FALSE)","v":1},{"$f":"VLOOKUP(D135, commute_factors, 3, FALSE)","v":2.4160314135984864},{"$f":"VLOOKUP(E135, commute_factors, 3, FALSE)","v":1},0,0,0,0,0]
["Dstart",{"$f":"'Background Controls'!I5","v":0},{"$f":"C111*(1/C$138)*(2*$C$53)*(1/C$137)*C$136*kg_mt*CO2_CO2e","v":0},0,{"$f":"E111*(1/E$138)*(2*$C$53)*(1/E$137)*E$136*kg_mt*CO2_CO2e","v":0},{"$f":"IF(ISERROR(F111*F$136*F$137*(1/(2*$C$53))*kg_mt*CO2_CO2e),0,F111*F$136*F$137*(1/(2*$C$53))*kg_mt*CO2_CO2e)","v":0},0,0,0,0,{"$f":"SUM(C139:J139)","v":0}]
[null,{"$f":"'Background Controls'!I6","v":0},0,0,0,0,0,0,0,0,{"$f":"SUM(C140:J140)","v":0}]
[null,{"$f":"'Background Controls'!I7","v":0},0,0,0,0,0,0,0,0,0]
[null,{"$f":"'Background Controls'!I8","v":0},0,0,0,0,0,0,0,0,0]
[null,{"$f":"'Background Controls'!I9","v":0},0,0,0,0,0,0,0,0,0]
[null,{"$f":"'Background Controls'!I10","v":0},0,0,0,0,0,0,0,0,0]
[null,{"$f":"'Background Controls'!I11","v":0},0,0,0,0,0,0,0,0,0]
[null,{"$f":"'Background Controls'!I12","v":0},0,0,0,0,0,0,0,0,0]
[null,{"$f":"'Background Controls'!I13","v":0},0,0,0,0,0,0,0,0,0]
[null,{"$f":"'Background Controls'!I14","v":0},0,0,0,0,0,0,0,0,0]
[null,{"$f":"'Background Controls'!I15","v":0},0,0,0,{"$f":"IF(ISERROR(F121*F$136*F$137*(1/(2*$C$53))*kg_mt*CO2_CO2e),0,F121*F$136*F$137*(1/(2*$C$53))*kg_mt*CO2_CO2e)","v":0},0,0,0,0,0]
[null,{"$f":"'Background Controls'!I16","v":0},0,0,0,0,0,0,0,0,0]
[null,{"$f":"'Background Controls'!I17","v":0},0,0,0,0,0,0,0,0,0]
[null,{"$f":"'Background Controls'!I18","v":0},0,0,0,0,0,0,0,0,0]
[null,{"$f":"'Background Controls'!I19","v":0},0,0,0,0,0,0,0,0,0]
[null,{"$f":"'Background Controls'!I20","v":0},0,0,0,0,0,0,0,0,0]
[null,{"$f":"'Background Controls'!I21","v":0},0,0,0,0,0,0,0,0,0]
[null,{"$f":"'Background Controls'!I22","v":0},0,0,0,0,0,0,0,0,0]
[null,{"$f":"'Background Controls'!I23","v":0},0,0,0,0,0,0,0,0,0]
[null,{"$f":"'Background Controls'!I24","v":0},0,0,0,0,0,0,0,0,0]
[null,"Total",{"$f":"SUM(C139:C158)","v":0},{"$f":"SUM(D139:D158)","v":0},0,0,0,0,0,0,{"$f":"SUM(K139:K158)","v":0}]
[]
["Annual CO2 Emissions by Department and Mode"]
["Annual CO2 Emissions (MT) = MT CO2/commute day × commute days/yr"]
[null,null,"Single Occupancy Vehicle","Carpool","Motorcycle","Transit","Bike","Walk","Work at Home","Other","TOTAL"]
["Dstart",{"$f":"'Background Controls'!I5","v":0},{"$f":"C139*$C$57","v":0},{"$f":"D139*$C$57","v":0},0,0,0,0,0,0,{"$f":"SUM(C164:J164)","v":0}]
[null,{"$f":"'Background Controls'!I6","v":0},{"$f":"C140*$C$57","v":0},0,0,0,0,0,0,0,{"$f":"SUM(C165:J165)","v":0}]
[null,{"$f":"'Background Controls'!I7","v":0},0,0,0,0,0,0,0,0,0]
[null,{"$f":"'Background Controls'!I8","v":0},0,0,0,0,0,0,0,0,0]
[null,{"$f":"'Background Controls'!I9","v":0},0,0,0,0,0,0,0,0,0]
[null,{"$f":"'Background Controls'!I10","v":0},0,0,0,0,0,0,0,0,0]
[null,{"$f":"'Background Controls'!I11","v":0},0,0,0,0,0,0,0,0,0]
[null,{"$f":"'Background Controls'!I12","v":0},0,0,0,0,0,0,0,0,0]
[null,{"$f":"'Background Controls'!I13","v":0},0,0,0,0,0,0,0,0,0]
[null,{"$f":"'Background Controls'!I14","v":0},0,0,0,0,0,0,0,0,0]
[null,{"$f":"'Background Controls'!I15","v":0},0,0,0,0,0,0,0,0,0]
[null,{"$f":"'Background Controls'!I16","v":0},0,0,0,0,0,0,0,0,0]
[null,{"$f":"'Background Controls'!I17","v":0},0,0,0,0,0,0,0,0,0]
[null,{"$f":"'Background Controls'!I18","v":0},0,0,0,0,0,0,0,0,0]
[null,{"$f":"'Background Controls'!I19","v":0},0,0,0,0,0,0,0,0,0]
[null,{"$f":"'Background Controls'!I20","v":0},0,0,0,0,0,0,0,0,0]
[null,{"$f":"'Background Controls'!I21","v":0},0,0,0,0,0,0,0,0,0]
[null,{"$f":"'Background Controls'!I22","v":0},0,0,0,0,0,0,0,0,0]
[null,{"$f":"'Background Controls'!I23","v":0},0,0,0,0,0,0,0,0,0]
[null,{"$f":"'Background Controls'!I24","v":0},0,0,0,0,0,0,0,0,0]
[null,"Total",{"$f":"SUM(C164:C183)","v":0},{"$f":"SUM(D164:D183)","v":0},{"$f":"SUM(E164:E183)","v":0},{"$f":"SUM(F164:F183)","v":0},{"$f":"SUM(G164:G183)","v":0},{"$f":"SUM(H164:H183)","v":0},{"$f":"SUM(I164:I183)","v":0},{"$f":"SUM(J164:J183)","v":0},{"$f":"SUM(K164:K183)","v":0}]
[]
[]
[]
["Tribal GHG Inventory Tool: Government Operations Module"]

{"sheet":"Water","index":25,"n_rows":243,"n_cols":18,"rows_kept":243,"cut":false,"hidden":false,"merged":[[242,0,242,11],[50,1,50,5],[129,1,129,3],[155,1,155,3],[182,1,182,3],[209,1,209,3]]}
["Water"]
["Data Entry and Calculations"]
[]
[]
[]
[]
[]
[]
[]
[null,"Please answer the following questions about your water use."]
[]
[null,"1) Does your tribe import water?"]
[null,null,null,null,null,null,null,null,null,null,null,null,null,null,null,null,2]
[]
[{"$f":"IF($Q$13=2, \"Show\", \"Hide\")","v":"Show"},"If no, then you have no Scope 3 emissions to calculate. Please enter any electricity or other energy use related to water on the appropriate Scope 1 tabs."]
[{"$f":"IF($Q$13=2, \"Show\", \"Hide\")","v":"Show"}]
[null,"2) What percent of water comes from imported sources?"]
[null,"Please enter the percent of water from imported, as opposed to local, sources. The percent of water from local sources will be computed automatically."]
[null,"% imported"]
[null,"% local",{"$f":"C21-C19","v":1}]
[null,"Total",1]
[]
[null,"3) How much water is consumed by each department?"]
[null,"Please enter data in the yellow cells below."]
[]
[]
[null,"Department","Water Use (gal)"]
["Dstart",{"$f":"'Background Controls'!I5","v":0}]
[null,{"$f":"'Background Controls'!I6","v":0}]
[null,{"$f":"'Background Controls'!I7","v":0}]
[null,{"$f":"'Background Controls'!I8","v":0}]
[null,{"$f":"'Background Controls'!I9","v":0}]
[null,{"$f":"'Background Controls'!I10","v":0}]
[null,{"$f":"'Background Controls'!I11","v":0}]
[null,{"$f":"'Background Controls'!I12","v":0}]
[null,{"$f":"'Background Controls'!I13","v":0}]
[null,{"$f":"'Background Controls'!I14","v":0}]
[null,{"$f":"'Background Controls'!I15","v":0}]
[null,{"$f":"'Background Controls'!I16","v":0}]
[null,{"$f":"'Background Controls'!I17","v":0}]
[null,{"$f":"'Background Controls'!I18","v":0}]
[null,{"$f":"'Background Controls'!I19","v":0}]
[null,{"$f":"'Background Controls'!I20","v":0}]
[null,{"$f":"'Background Controls'!I21","v":0}]
[null,{"$f":"'Background Controls'!I22","v":0}]
[null,{"$f":"'Background Controls'!I23","v":0}]
[null,{"$f":"'Background Controls'!I24","v":0}]
[]
["Water Emissions Summary"]
[]
[null,"Water Consumption Emissions (MT CO2e)"]
[null,null,"CO2","CH4","N2O","TOTAL"]
["Dstart",{"$f":"'Background Controls'!I5","v":0},{"$f":"IF(ISERROR(D160),\"\",D160)","v":0},{"$f":"IF(ISERROR(D187),\"\",D187)","v":""},{"$f":"IF(ISERROR(D214),\"\",D214)","v":""},{"$f":"SUM(C53:E53)","v":0}]
[null,{"$f":"'Background Controls'!I6","v":0},{"$f":"IF(ISERROR(D161),\"\",D161)","v":0},{"$f":"IF(ISERROR(D188),\"\",D188)","v":""},{"$f":"IF(ISERROR(D215),\"\",D215)","v":""},{"$f":"SUM(C54:E54)","v":0}]
[null,{"$f":"'Background Controls'!I7","v":0},0,"","",0]
[null,{"$f":"'Background Controls'!I8","v":0},0,"","",0]
[null,{"$f":"'Background Controls'!I9","v":0},0,"","",0]
[null,{"$f":"'Background Controls'!I10","v":0},0,"","",0]
[null,{"$f":"'Background Controls'!I11","v":0},0,"","",0]
[null,{"$f":"'Background Controls'!I12","v":0},0,"","",0]
[null,{"$f":"'Background Controls'!I13","v":0},0,"","",0]
[null,{"$f":"'Background Controls'!I14","v":0},0,"","",0]
[null,{"$f":"'Background Controls'!I15","v":0},0,"","",0]
[null,{"$f":"'Background Controls'!I16","v":0},0,"","",0]
[null,{"$f":"'Background Controls'!I17","v":0},0,"","",0]
[null,{"$f":"'Background Controls'!I18","v":0},0,"","",0]
[null,{"$f":"'Background Controls'!I19","v":0},0,"","",0]
[null,{"$f":"'Background Controls'!I20","v":0},0,"","",0]
[null,{"$f":"'Background Controls'!I21","v":0},0,"","",0]
[null,{"$f":"'Background Controls'!I22","v":0},0,"","",0]
[null,{"$f":"'Background Controls'!I23","v":0},0,"","",0]
[null,{"$f":"'Background Controls'!I24","v":0},0,"","",0]
[null,"Total Emissions from Water Consumption",{"$f":"IF(ISERROR(SUM(C53:C72)),\"\",SUM(C53:C72))","v":0},{"$f":"IF(ISERROR(SUM(D53:D72)),\"\",SUM(D53:D72))","v":0},{"$f":"IF(ISERROR(SUM(E53:E72)),\"\",SUM(E53:E72))","v":0},{"$f":"IF(ISERROR(SUM(F53:F72)),\"\",SUM(F53:F72))","v":0}]
[]
[null,null,null,null,null,null,null,null,null,null,null,null,null,null,null,null,"emissions",true]
[null,null,null,null,null,null,null,null,null,null,null,null,null,null,null,null,"water",true]
[null,null,null,null,null,null,null,null,null,null,null,null,null,null,null,null,"both",{"$f":"AND(R75:R76)","v":true}]
[null,null,null,null,null,null,null,null,null,null,null,null,null,null,null,null,null,{"$f":"IF(R77=TRUE, Q77, IF(R75=TRUE, Q75, IF(R76=TRUE, Q76,\"both\")))","v":"both"}]
[]
[]
[]
[]
[]
[]
[]
[]
[]
[]
[]
[]
[]
[]
[]
[]
[]
[]
[]
[]
[]
[null,"Check to Display: ",null,null,null,null,null,null,null,null,null,null,null,null,null,null,"emissions",true]
[null,null,null,null,null,null,null,null,null,null,null,null,null,null,null,null,"water",true]
[null,null,null,null,null,null,null,null,null,null,null,null,null,null,null,null,"both",{"$f":"AND(R100:R101)","v":true}]
[null,null,null,null,null,null,null,null,null,null,null,null,null,null,null,null,null,{"$f":"IF(R102=TRUE, Q102, IF(R100=TRUE, Q100, IF(R101=TRUE, Q101,\"both\")))","v":"both"}]
[]
[]
[]
[]
[]
[]
[]
[]
[]
[]
[]
[]
[]
[]
[]
[]
[]
[]
[]
[]
[]
[]
["Background Calculations"]
[]
["Imported Water Consumption by Department"]
["Imported Water (gallons) = Total Water Consumption (gal) × Percent of Water Imported"]
[null,"Imported Water by Source (gallons)"]
[null,null,"Imported Water","TOTAL"]
["Dstart",{"$f":"'Background Controls'!I5","v":0},{"$f":"$C28*$C$19","v":0},{"$f":"C132","v":0}]
[null,{"$f":"'Background Controls'!I6","v":0},{"$f":"$C29*$C$19","v":0},0]
[null,{"$f":"'Background Controls'!I7","v":0},0,0]
[null,{"$f":"'Background Controls'!I8","v":0},0,0]
[null,{"$f":"'Background Controls'!I9","v":0},0,0]
[null,{"$f":"'Background Controls'!I10","v":0},0,0]
[null,{"$f":"'Background Controls'!I11","v":0},0,0]
[null,{"$f":"'Background Controls'!I12","v":0},0,0]
[null,{"$f":"'Background Controls'!I13","v":0},0,0]
[null,{"$f":"'Background Controls'!I14","v":0},0,0]
[null,{"$f":"'Background Controls'!I15","v":0},0,0]
[null,{"$f":"'Background Controls'!I16","v":0},0,0]
[null,{"$f":"'Background Controls'!I17","v":0},{"$f":"$C40*$C$19","v":0},0]
[null,{"$f":"'Background Controls'!I18","v":0},0,0]
[null,{"$f":"'Background Controls'!I19","v":0},0,0]
[null,{"$f":"'Background Controls'!I20","v":0},0,0]
[null,{"$f":"'Background Controls'!I21","v":0},0,0]
[null,{"$f":"'Background Controls'!I22","v":0},0,0]
[null,{"$f":"'Background Controls'!I23","v":0},0,0]
[null,{"$f":"'Background Controls'!I24","v":0},0,0]
[null,"Total",{"$f":"SUM(C132:C151)","v":0},0]
[]
["Emissions from Imported Water by Department"]
["CO2 Emissions (MT CO2e) = Imported Water Consumed (gal) × Water Electricity Intensity (kWh/Mgal) × Electricity Emission Factor (lb CO2/MWH) × MG/gal × MT/lb × MWh/kWh × GWP CO2"]
[null,"CO2 Emissions from Imported Water (MT CO2e)"]
[null,null,null,"TOTAL"]
[null,"Energy Intensity of Water (kWh/MG)",{"$f":"AVERAGE(Factors!$C$302:$C$305)","v":5604.397429120615}]
[null,"EF (lb CO2/MWh)",{"$f":"IF(ISERROR(VLOOKUP(\"CO2\", water_factors_elec, elec_colindex_MyYear, FALSE)),0,VLOOKUP(\"CO2\", water_factors_elec, elec_colindex_MyYear, FALSE))","v":0}]
["Dstart",{"$f":"'Background Controls'!I5","v":0},{"$f":"C132*C$158*gal_MG*C$159*lb_mt*kWh_MWh*CO2_CO2e","v":0},{"$f":"C160","v":0}]
[null,{"$f":"'Background Controls'!I6","v":0},{"$f":"C133*C$158*gal_MG*C$159*lb_mt*kWh_MWh*CO2_CO2e","v":0},0]
[null,{"$f":"'Background Controls'!I7","v":0},0,0]
[null,{"$f":"'Background Controls'!I8","v":0},0,0]
[null,{"$f":"'Background Controls'!I9","v":0},0,0]
[null,{"$f":"'Background Controls'!I10","v":0},0,0]
[null,{"$f":"'Background Controls'!I11","v":0},0,0]
[null,{"$f":"'Background Controls'!I12","v":0},0,0]
[null,{"$f":"'Background Controls'!I13","v":0},0,0]
[null,{"$f":"'Background Controls'!I14","v":0},0,0]
[null,{"$f":"'Background Controls'!I15","v":0},0,0]
[null,{"$f":"'Background Controls'!I16","v":0},0,0]
[null,{"$f":"'Background Controls'!I17","v":0},0,0]
[null,{"$f":"'Background Controls'!I18","v":0},0,0]
[null,{"$f":"'Background Controls'!I19","v":0},0,0]
[null,{"$f":"'Background Controls'!I20","v":0},0,0]
[null,{"$f":"'Background Controls'!I21","v":0},0,0]
[null,{"$f":"'Background Controls'!I22","v":0},0,0]
[null,{"$f":"'Background Controls'!I23","v":0},0,0]
[null,{"$f":"'Background Controls'!I24","v":0},0,0]
[null,"Total",{"$f":"SUM(C160:C179)","v":0},0]
[]
["CH4 Emissions (MT CO2e) = Imported Water Consumed (gal) × Water Electricity Intensity (kWh/Mgal) × Electricity Emission Factor (lb CH4/MWH) × MG/gal × MT/lb × MWh/kWh × GWP CH4"]
[null,"CH4 Emissions from Imported Water (MT CO2e)"]
[null,null,null,"TOTAL"]
[null,"Energy Intensity of Water (kWh/MG)",{"$f":"C158","v":5604.397429120615}]
[null,"EF (lb CH4/MWh)",{"$f":"VLOOKUP(\"CH4\", water_factors_elec, elec_colindex_MyYear, FALSE)","v":{"$error":"#VALUE!"}}]
["Dstart",{"$f":"'Background Controls'!I5","v":0},{"$f":"C132*C$185*gal_MG*C$186*lb_mt*kWh_MWh*CH4_CO2e","v":{"$error":"#VALUE!"}},{"$f":"C187","v":{"$error":"#VALUE!"}}]
[null,{"$f":"'Background Controls'!I6","v":0},{"$error":"#VALUE!"},{"$error":"#VALUE!"}]
[null,{"$f":"'Background Controls'!I7","v":0},{"$error":"#VALUE!"},{"$error":"#VALUE!"}]
[null,{"$f":"'Background Controls'!I8","v":0},{"$error":"#VALUE!"},{"$error":"#VALUE!"}]
[null,{"$f":"'Background Controls'!I9","v":0},{"$error":"#VALUE!"},{"$error":"#VALUE!"}]
[null,{"$f":"'Background Controls'!I10","v":0},{"$error":"#VALUE!"},{"$error":"#VALUE!"}]
[null,{"$f":"'Background Controls'!I11","v":0},{"$error":"#VALUE!"},{"$error":"#VALUE!"}]
[null,{"$f":"'Background Controls'!I12","v":0},{"$error":"#VALUE!"},{"$error":"#VALUE!"}]
[null,{"$f":"'Background Controls'!I13","v":0},{"$error":"#VALUE!"},{"$error":"#VALUE!"}]
[null,{"$f":"'Background Controls'!I14","v":0},{"$error":"#VALUE!"},{"$error":"#VALUE!"}]
[null,{"$f":"'Background Controls'!I15","v":0},{"$error":"#VALUE!"},{"$error":"#VALUE!"}]
[null,{"$f":"'Background Controls'!I16","v":0},{"$error":"#VALUE!"},{"$error":"#VALUE!"}]
[null,{"$f":"'Background Controls'!I17","v":0},{"$error":"#VALUE!"},{"$error":"#VALUE!"}]
[null,{"$f":"'Background Controls'!I18","v":0},{"$error":"#VALUE!"},{"$error":"#VALUE!"}]
[null,{"$f":"'Background Controls'!I19","v":0},{"$error":"#VALUE!"},{"$error":"#VALUE!"}]
[null,{"$f":"'Background Controls'!I20","v":0},{"$error":"#VALUE!"},{"$error":"#VALUE!"}]
[null,{"$f":"'Background Controls'!I21","v":0},{"$error":"#VALUE!"},{"$error":"#VALUE!"}]
[null,{"$f":"'Background Controls'!I22","v":0},{"$error":"#VALUE!"},{"$error":"#VALUE!"}]
[null,{"$f":"'Background Controls'!I23","v":0},{"$error":"#VALUE!"},{"$error":"#VALUE!"}]
[null,{"$f":"'Background Controls'!I24","v":0},{"$error":"#VALUE!"},{"$error":"#VALUE!"}]
[null,"Total",{"$f":"SUM(C187:C206)","v":{"$error":"#VALUE!"}},{"$error":"#VALUE!"}]
[]
["N2O Emissions (MT CO2e) = Imported Water Consumed (gal) × Water Electricity Intensity (kWh/Mgal) × Electricity Emission Factor (lb N2O/MWH) × MG/gal × MT/lb × MWh/kWh × GWP N2O"]
[null,"N2O Emissions from Imported Water (MT CO2e)"]
[null,null,null,"TOTAL"]
[null,"Energy Intensity of Water (kWh/MG)",{"$f":"C185","v":5604.397429120615}]
[null,"EF (lb N2O/MWh)",{"$f":"VLOOKUP(\"N2O\", water_factors_elec, elec_colindex_MyYear, FALSE)","v":{"$error":"#VALUE!"}}]
["Dstart",{"$f":"'Background Controls'!I5","v":0},{"$f":"C132*C$212*gal_MG*C$213*lb_mt*kWh_MWh*N2O_CO2e","v":{"$error":"#VALUE!"}},{"$f":"C214","v":{"$error":"#VALUE!"}}]
[null,{"$f":"'Background Controls'!I6","v":0},{"$error":"#VALUE!"},{"$f":"C215","v":{"$error":"#VALUE!"}}]
[null,{"$f":"'Background Controls'!I7","v":0},{"$error":"#VALUE!"},{"$f":"C216","v":{"$error":"#VALUE!"}}]
[null,{"$f":"'Background Controls'!I8","v":0},{"$error":"#VALUE!"},{"$f":"C217","v":{"$error":"#VALUE!"}}]
[null,{"$f":"'Background Controls'!I9","v":0},{"$error":"#VALUE!"},{"$f":"C218","v":{"$error":"#VALUE!"}}]
[null,{"$f":"'Background Controls'!I10","v":0},{"$error":"#VALUE!"},{"$error":"#VALUE!"}]
[null,{"$f":"'Background Controls'!I11","v":0},{"$error":"#VALUE!"},{"$error":"#VALUE!"}]
[null,{"$f":"'Background Controls'!I12","v":0},{"$error":"#VALUE!"},{"$error":"#VALUE!"}]
[null,{"$f":"'Background Controls'!I13","v":0},{"$error":"#VALUE!"},{"$error":"#VALUE!"}]
[null,{"$f":"'Background Controls'!I14","v":0},{"$error":"#VALUE!"},{"$error":"#VALUE!"}]
[null,{"$f":"'Background Controls'!I15","v":0},{"$error":"#VALUE!"},{"$error":"#VALUE!"}]
[null,{"$f":"'Background Controls'!I16","v":0},{"$error":"#VALUE!"},{"$error":"#VALUE!"}]
[null,{"$f":"'Background Controls'!I17","v":0},{"$error":"#VALUE!"},{"$error":"#VALUE!"}]
[null,{"$f":"'Background Controls'!I18","v":0},{"$error":"#VALUE!"},{"$error":"#VALUE!"}]
[null,{"$f":"'Background Controls'!I19","v":0},{"$error":"#VALUE!"},{"$error":"#VALUE!"}]
[null,{"$f":"'Background Controls'!I20","v":0},{"$error":"#VALUE!"},{"$error":"#VALUE!"}]
[null,{"$f":"'Background Controls'!I21","v":0},{"$error":"#VALUE!"},{"$error":"#VALUE!"}]
[null,{"$f":"'Background Controls'!I22","v":0},{"$error":"#VALUE!"},{"$error":"#VALUE!"}]
[null,{"$f":"'Background Controls'!I23","v":0},{"$error":"#VALUE!"},{"$error":"#VALUE!"}]
[null,{"$f":"'Background Controls'!I24","v":0},{"$error":"#VALUE!"},{"$error":"#VALUE!"}]
[null,"Total",{"$f":"SUM(C214:C233)","v":{"$error":"#VALUE!"}},{"$f":"C234","v":{"$error":"#VALUE!"}}]
[]
["Total Emissions by Import Source"]
[null,null,"Imported Water"]
[null,"Total Emissions       (MT CO2e)",{"$f":"C180+C207+C234","v":{"$error":"#VALUE!"}}]
[]
[]
[]
[]
["Tribal GHG Inventory Tool: Government Operations Module"]

{"sheet":"Agriculture & Land Management","index":26,"n_rows":69,"n_cols":6,"rows_kept":69,"cut":false,"hidden":false,"merged":[[68,0,68,21],[33,1,33,4]]}
["Agriculture & Land Management"]
["Data Entry & Calculations"]
[]
[]
[]
[]
["1. Enter Fertilizer Consumption Data for Each Department."]
["Please enter the amount of synthetic, organic, or manure fertilizer applied."]
[]
[null,"Department","Synthetic \n(short tons N)","Organic \n(short tons)","Manure \n(short tons)"]
["Dstart",{"$f":"'Background Controls'!I5","v":0}]
[null,{"$f":"'Background Controls'!I6","v":0}]
[null,{"$f":"'Background Controls'!I7","v":0}]
[null,{"$f":"'Background Controls'!I8","v":0}]
[null,{"$f":"'Background Controls'!I9","v":0}]
[null,{"$f":"'Background Controls'!I10","v":0}]
[null,{"$f":"'Background Controls'!I11","v":0}]
[null,{"$f":"'Background Controls'!I12","v":0}]
[null,{"$f":"'Background Controls'!I13","v":0}]
[null,{"$f":"'Background Controls'!I14","v":0}]
[null,{"$f":"'Background Controls'!I15","v":0}]
[null,{"$f":"'Background Controls'!I16","v":0}]
[null,{"$f":"'Background Controls'!I17","v":0}]
[null,{"$f":"'Background Controls'!I18","v":0}]
[null,{"$f":"'Background Controls'!I19","v":0}]
[null,{"$f":"'Background Controls'!I20","v":0}]
[null,{"$f":"'Background Controls'!I21","v":0}]
[null,{"$f":"'Background Controls'!I22","v":0}]
[null,{"$f":"'Background Controls'!I23","v":0}]
[null,{"$f":"'Background Controls'!I24","v":0}]
[]
["Fertilizer Emissions Summary"]
[]
[null,"Fertilizer Application Emissions (MT CO2e)"]
[null,null,"Synthetic N2O","Organic N2O","Manure N2O","TOTAL"]
["Dstart",{"$f":"'Background Controls'!I5","v":0},{"$f":"((C11*Factors!$B$323*(1-Factors!$C$323)*Factors!$E$323)+(C11*Factors!$B$323*Factors!$C$323*Factors!$F$323)+(C11*Factors!$B$323*(1-Factors!$C$323)*Factors!$D$323*Factors!$G$323))*N2O_N2ON*GWP_N2O*mt_shortton","v":0},{"$f":"((D11*Factors!$B$324*(1-Factors!$C$324)*Factors!$E$324)+(D11*Factors!$B$324*Factors!$C$324*Factors!$F$324)+(D11*Factors!$B$324*(1-Factors!$C$324)*Factors!$D$324*Factors!$G$324))*N2O_N2ON*GWP_N2O*mt_shortton","v":0},{"$f":"((E11*Factors!$B$325*(1-Factors!$C$325)*Factors!$E$325)+(E11*Factors!$B$325*Factors!$C$325*Factors!$F$325)+(E11*Factors!$B$325*(1-Factors!$C$325)*Factors!$D$325*Factors!$G$325))*N2O_N2ON*GWP_N2O*mt_shortton","v":0},{"$f":"SUM(C36:E36)","v":0}]
[null,{"$f":"'Background Controls'!I6","v":0},{"$f":"((C12*Factors!$B$323*(1-Factors!$C$323)*Factors!$E$323)+(C12*Factors!$B$323*Factors!$C$323*Factors!$F$323)+(C12*Factors!$B$323*(1-Factors!$C$323)*Factors!$D$323*Factors!$G$323))*N2O_N2ON*GWP_N2O*mt_shortton","v":0},{"$f":"((D12*Factors!$B$324*(1-Factors!$C$324)*Factors!$E$324)+(D12*Factors!$B$324*Factors!$C$324*Factors!$F$324)+(D12*Factors!$B$324*(1-Factors!$C$324)*Factors!$D$324*Factors!$G$324))*N2O_N2ON*GWP_N2O*mt_shortton","v":0},{"$f":"((E12*Factors!$B$325*(1-Factors!$C$325)*Factors!$E$325)+(E12*Factors!$B$325*Factors!$C$325*Factors!$F$325)+(E12*Factors!$B$325*(1-Factors!$C$325)*Factors!$D$325*Factors!$G$325))*N2O_N2ON*GWP_N2O*mt_shortton","v":0},{"$f":"SUM(C37:E37)","v":0}]
[null,{"$f":"'Background Controls'!I7","v":0},{"$f":"((C13*Factors!$B$323*(1-Factors!$C$323)*Factors!$E$323)+(C13*Factors!$B$323*Factors!$C$323*Factors!$F$323)+(C13*Factors!$B$323*(1-Factors!$C$323)*Factors!$D$323*Factors!$G$323))*N2O_N2ON*GWP_N2O*mt_shortton","v":0},{"$f":"((D13*Factors!$B$324*(1-Factors!$C$324)*Factors!$E$324)+(D13*Factors!$B$324*Factors!$C$324*Factors!$F$324)+(D13*Factors!$B$324*(1-Factors!$C$324)*Factors!$D$324*Factors!$G$324))*N2O_N2ON*GWP_N2O*mt_shortton","v":0},{"$f":"((E13*Factors!$B$325*(1-Factors!$C$325)*Factors!$E$325)+(E13*Factors!$B$325*Factors!$C$325*Factors!$F$325)+(E13*Factors!$B$325*(1-Factors!$C$325)*Factors!$D$325*Factors!$G$325))*N2O_N2ON*GWP_N2O*mt_shortton","v":0},0]
[null,{"$f":"'Background Controls'!I8","v":0},{"$f":"((C14*Factors!$B$323*(1-Factors!$C$323)*Factors!$E$323)+(C14*Factors!$B$323*Factors!$C$323*Factors!$F$323)+(C14*Factors!$B$323*(1-Factors!$C$323)*Factors!$D$323*Factors!$G$323))*N2O_N2ON*GWP_N2O*mt_shortton","v":0},{"$f":"((D14*Factors!$B$324*(1-Factors!$C$324)*Factors!$E$324)+(D14*Factors!$B$324*Factors!$C$324*Factors!$F$324)+(D14*Factors!$B$324*(1-Factors!$C$324)*Factors!$D$324*Factors!$G$324))*N2O_N2ON*GWP_N2O*mt_shortton","v":0},{"$f":"((E14*Factors!$B$325*(1-Factors!$C$325)*Factors!$E$325)+(E14*Factors!$B$325*Factors!$C$325*Factors!$F$325)+(E14*Factors!$B$325*(1-Factors!$C$325)*Factors!$D$325*Factors!$G$325))*N2O_N2ON*GWP_N2O*mt_shortton","v":0},0]
[null,{"$f":"'Background Controls'!I9","v":0},{"$f":"((C15*Factors!$B$323*(1-Factors!$C$323)*Factors!$E$323)+(C15*Factors!$B$323*Factors!$C$323*Factors!$F$323)+(C15*Factors!$B$323*(1-Factors!$C$323)*Factors!$D$323*Factors!$G$323))*N2O_N2ON*GWP_N2O*mt_shortton","v":0},{"$f":"((D15*Factors!$B$324*(1-Factors!$C$324)*Factors!$E$324)+(D15*Factors!$B$324*Factors!$C$324*Factors!$F$324)+(D15*Factors!$B$324*(1-Factors!$C$324)*Factors!$D$324*Factors!$G$324))*N2O_N2ON*GWP_N2O*mt_shortton","v":0},{"$f":"((E15*Factors!$B$325*(1-Factors!$C$325)*Factors!$E$325)+(E15*Factors!$B$325*Factors!$C$325*Factors!$F$325)+(E15*Factors!$B$325*(1-Factors!$C$325)*Factors!$D$325*Factors!$G$325))*N2O_N2ON*GWP_N2O*mt_shortton","v":0},0]
[null,{"$f":"'Background Controls'!I10","v":0},{"$f":"((C16*Factors!$B$323*(1-Factors!$C$323)*Factors!$E$323)+(C16*Factors!$B$323*Factors!$C$323*Factors!$F$323)+(C16*Factors!$B$323*(1-Factors!$C$323)*Factors!$D$323*Factors!$G$323))*N2O_N2ON*GWP_N2O*mt_shortton","v":0},{"$f":"((D16*Factors!$B$324*(1-Factors!$C$324)*Factors!$E$324)+(D16*Factors!$B$324*Factors!$C$324*Factors!$F$324)+(D16*Factors!$B$324*(1-Factors!$C$324)*Factors!$D$324*Factors!$G$324))*N2O_N2ON*GWP_N2O*mt_shortton","v":0},{"$f":"((E16*Factors!$B$325*(1-Factors!$C$325)*Factors!$E$325)+(E16*Factors!$B$325*Factors!$C$325*Factors!$F$325)+(E16*Factors!$B$325*(1-Factors!$C$325)*Factors!$D$325*Factors!$G$325))*N2O_N2ON*GWP_N2O*mt_shortton","v":0},0]
[null,{"$f":"'Background Controls'!I11","v":0},{"$f":"((C17*Factors!$B$323*(1-Factors!$C$323)*Factors!$E$323)+(C17*Factors!$B$323*Factors!$C$323*Factors!$F$323)+(C17*Factors!$B$323*(1-Factors!$C$323)*Factors!$D$323*Factors!$G$323))*N2O_N2ON*GWP_N2O*mt_shortton","v":0},{"$f":"((D17*Factors!$B$324*(1-Factors!$C$324)*Factors!$E$324)+(D17*Factors!$B$324*Factors!$C$324*Factors!$F$324)+(D17*Factors!$B$324*(1-Factors!$C$324)*Factors!$D$324*Factors!$G$324))*N2O_N2ON*GWP_N2O*mt_shortton","v":0},{"$f":"((E17*Factors!$B$325*(1-Factors!$C$325)*Factors!$E$325)+(E17*Factors!$B$325*Factors!$C$325*Factors!$F$325)+(E17*Factors!$B$325*(1-Factors!$C$325)*Factors!$D$325*Factors!$G$325))*N2O_N2ON*GWP_N2O*mt_shortton","v":0},0]
[null,{"$f":"'Background Controls'!I12","v":0},{"$f":"((C18*Factors!$B$323*(1-Factors!$C$323)*Factors!$E$323)+(C18*Factors!$B$323*Factors!$C$323*Factors!$F$323)+(C18*Factors!$B$323*(1-Factors!$C$323)*Factors!$D$323*Factors!$G$323))*N2O_N2ON*GWP_N2O*mt_shortton","v":0},{"$f":"((D18*Factors!$B$324*(1-Factors!$C$324)*Factors!$E$324)+(D18*Factors!$B$324*Factors!$C$324*Factors!$F$324)+(D18*Factors!$B$324*(1-Factors!$C$324)*Factors!$D$324*Factors!$G$324))*N2O_N2ON*GWP_N2O*mt_shortton","v":0},{"$f":"((E18*Factors!$B$325*(1-Factors!$C$325)*Factors!$E$325)+(E18*Factors!$B$325*Factors!$C$325*Factors!$F$325)+(E18*Factors!$B$325*(1-Factors!$C$325)*Factors!$D$325*Factors!$G$325))*N2O_N2ON*GWP_N2O*mt_shortton","v":0},0]
[null,{"$f":"'Background Controls'!I13","v":0},{"$f":"((C19*Factors!$B$323*(1-Factors!$C$323)*Factors!$E$323)+(C19*Factors!$B$323*Factors!$C$323*Factors!$F$323)+(C19*Factors!$B$323*(1-Factors!$C$323)*Factors!$D$323*Factors!$G$323))*N2O_N2ON*GWP_N2O*mt_shortton","v":0},{"$f":"((D19*Factors!$B$324*(1-Factors!$C$324)*Factors!$E$324)+(D19*Factors!$B$324*Factors!$C$324*Factors!$F$324)+(D19*Factors!$B$324*(1-Factors!$C$324)*Factors!$D$324*Factors!$G$324))*N2O_N2ON*GWP_N2O*mt_shortton","v":0},{"$f":"((E19*Factors!$B$325*(1-Factors!$C$325)*Factors!$E$325)+(E19*Factors!$B$325*Factors!$C$325*Factors!$F$325)+(E19*Factors!$B$325*(1-Factors!$C$325)*Factors!$D$325*Factors!$G$325))*N2O_N2ON*GWP_N2O*mt_shortton","v":0},0]
[null,{"$f":"'Background Controls'!I14","v":0},{"$f":"((C20*Factors!$B$323*(1-Factors!$C$323)*Factors!$E$323)+(C20*Factors!$B$323*Factors!$C$323*Factors!$F$323)+(C20*Factors!$B$323*(1-Factors!$C$323)*Factors!$D$323*Factors!$G$323))*N2O_N2ON*GWP_N2O*mt_shortton","v":0},{"$f":"((D20*Factors!$B$324*(1-Factors!$C$324)*Factors!$E$324)+(D20*Factors!$B$324*Factors!$C$324*Factors!$F$324)+(D20*Factors!$B$324*(1-Factors!$C$324)*Factors!$D$324*Factors!$G$324))*N2O_N2ON*GWP_N2O*mt_shortton","v":0},{"$f":"((E20*Factors!$B$325*(1-Factors!$C$325)*Factors!$E$325)+(E20*Factors!$B$325*Factors!$C$325*Factors!$F$325)+(E20*Factors!$B$325*(1-Factors!$C$325)*Factors!$D$325*Factors!$G$325))*N2O_N2ON*GWP_N2O*mt_shortton","v":0},0]
[null,{"$f":"'Background Controls'!I15","v":0},{"$f":"((C21*Factors!$B$323*(1-Factors!$C$323)*Factors!$E$323)+(C21*Factors!$B$323*Factors!$C$323*Factors!$F$323)+(C21*Factors!$B$323*(1-Factors!$C$323)*Factors!$D$323*Factors!$G$323))*N2O_N2ON*GWP_N2O*mt_shortton","v":0},{"$f":"((D21*Factors!$B$324*(1-Factors!$C$324)*Factors!$E$324)+(D21*Factors!$B$324*Factors!$C$324*Factors!$F$324)+(D21*Factors!$B$324*(1-Factors!$C$324)*Factors!$D$324*Factors!$G$324))*N2O_N2ON*GWP_N2O*mt_shortton","v":0},{"$f":"((E21*Factors!$B$325*(1-Factors!$C$325)*Factors!$E$325)+(E21*Factors!$B$325*Factors!$C$325*Factors!$F$325)+(E21*Factors!$B$325*(1-Factors!$C$325)*Factors!$D$325*Factors!$G$325))*N2O_N2ON*GWP_N2O*mt_shortton","v":0},0]
[null,{"$f":"'Background Controls'!I16","v":0},{"$f":"((C22*Factors!$B$323*(1-Factors!$C$323)*Factors!$E$323)+(C22*Factors!$B$323*Factors!$C$323*Factors!$F$323)+(C22*Factors!$B$323*(1-Factors!$C$323)*Factors!$D$323*Factors!$G$323))*N2O_N2ON*GWP_N2O*mt_shortton","v":0},{"$f":"((D22*Factors!$B$324*(1-Factors!$C$324)*Factors!$E$324)+(D22*Factors!$B$324*Factors!$C$324*Factors!$F$324)+(D22*Factors!$B$324*(1-Factors!$C$324)*Factors!$D$324*Factors!$G$324))*N2O_N2ON*GWP_N2O*mt_shortton","v":0},{"$f":"((E22*Factors!$B$325*(1-Factors!$C$325)*Factors!$E$325)+(E22*Factors!$B$325*Factors!$C$325*Factors!$F$325)+(E22*Factors!$B$325*(1-Factors!$C$325)*Factors!$D$325*Factors!$G$325))*N2O_N2ON*GWP_N2O*mt_shortton","v":0},0]
[null,{"$f":"'Background Controls'!I17","v":0},{"$f":"((C23*Factors!$B$323*(1-Factors!$C$323)*Factors!$E$323)+(C23*Factors!$B$323*Factors!$C$323*Factors!$F$323)+(C23*Factors!$B$323*(1-Factors!$C$323)*Factors!$D$323*Factors!$G$323))*N2O_N2ON*GWP_N2O*mt_shortton","v":0},{"$f":"((D23*Factors!$B$324*(1-Factors!$C$324)*Factors!$E$324)+(D23*Factors!$B$324*Factors!$C$324*Factors!$F$324)+(D23*Factors!$B$324*(1-Factors!$C$324)*Factors!$D$324*Factors!$G$324))*N2O_N2ON*GWP_N2O*mt_shortton","v":0},{"$f":"((E23*Factors!$B$325*(1-Factors!$C$325)*Factors!$E$325)+(E23*Factors!$B$325*Factors!$C$325*Factors!$F$325)+(E23*Factors!$B$325*(1-Factors!$C$325)*Factors!$D$325*Factors!$G$325))*N2O_N2ON*GWP_N2O*mt_shortton","v":0},0]
[null,{"$f":"'Background Controls'!I18","v":0},{"$f":"((C24*Factors!$B$323*(1-Factors!$C$323)*Factors!$E$323)+(C24*Factors!$B$323*Factors!$C$323*Factors!$F$323)+(C24*Factors!$B$323*(1-Factors!$C$323)*Factors!$D$323*Factors!$G$323))*N2O_N2ON*GWP_N2O*mt_shortton","v":0},{"$f":"((D24*Factors!$B$324*(1-Factors!$C$324)*Factors!$E$324)+(D24*Factors!$B$324*Factors!$C$324*Factors!$F$324)+(D24*Factors!$B$324*(1-Factors!$C$324)*Factors!$D$324*Factors!$G$324))*N2O_N2ON*GWP_N2O*mt_shortton","v":0},{"$f":"((E24*Factors!$B$325*(1-Factors!$C$325)*Factors!$E$325)+(E24*Factors!$B$325*Factors!$C$325*Factors!$F$325)+(E24*Factors!$B$325*(1-Factors!$C$325)*Factors!$D$325*Factors!$G$325))*N2O_N2ON*GWP_N2O*mt_shortton","v":0},0]
[null,{"$f":"'Background Controls'!I19","v":0},{"$f":"((C25*Factors!$B$323*(1-Factors!$C$323)*Factors!$E$323)+(C25*Factors!$B$323*Factors!$C$323*Factors!$F$323)+(C25*Factors!$B$323*(1-Factors!$C$323)*Factors!$D$323*Factors!$G$323))*N2O_N2ON*GWP_N2O*mt_shortton","v":0},{"$f":"((D25*Factors!$B$324*(1-Factors!$C$324)*Factors!$E$324)+(D25*Factors!$B$324*Factors!$C$324*Factors!$F$324)+(D25*Factors!$B$324*(1-Factors!$C$324)*Factors!$D$324*Factors!$G$324))*N2O_N2ON*GWP_N2O*mt_shortton","v":0},{"$f":"((E25*Factors!$B$325*(1-Factors!$C$325)*Factors!$E$325)+(E25*Factors!$B$325*Factors!$C$325*Factors!$F$325)+(E25*Factors!$B$325*(1-Factors!$C$325)*Factors!$D$325*Factors!$G$325))*N2O_N2ON*GWP_N2O*mt_shortton","v":0},0]
[null,{"$f":"'Background Controls'!I20","v":0},{"$f":"((C26*Factors!$B$323*(1-Factors!$C$323)*Factors!$E$323)+(C26*Factors!$B$323*Factors!$C$323*Factors!$F$323)+(C26*Factors!$B$323*(1-Factors!$C$323)*Factors!$D$323*Factors!$G$323))*N2O_N2ON*GWP_N2O*mt_shortton","v":0},{"$f":"((D26*Factors!$B$324*(1-Factors!$C$324)*Factors!$E$324)+(D26*Factors!$B$324*Factors!$C$324*Factors!$F$324)+(D26*Factors!$B$324*(1-Factors!$C$324)*Factors!$D$324*Factors!$G$324))*N2O_N2ON*GWP_N2O*mt_shortton","v":0},{"$f":"((E26*Factors!$B$325*(1-Factors!$C$325)*Factors!$E$325)+(E26*Factors!$B$325*Factors!$C$325*Factors!$F$325)+(E26*Factors!$B$325*(1-Factors!$C$325)*Factors!$D$325*Factors!$G$325))*N2O_N2ON*GWP_N2O*mt_shortton","v":0},0]
[null,{"$f":"'Background Controls'!I21","v":0},{"$f":"((C27*Factors!$B$323*(1-Factors!$C$323)*Factors!$E$323)+(C27*Factors!$B$323*Factors!$C$323*Factors!$F$323)+(C27*Factors!$B$323*(1-Factors!$C$323)*Factors!$D$323*Factors!$G$323))*N2O_N2ON*GWP_N2O*mt_shortton","v":0},{"$f":"((D27*Factors!$B$324*(1-Factors!$C$324)*Factors!$E$324)+(D27*Factors!$B$324*Factors!$C$324*Factors!$F$324)+(D27*Factors!$B$324*(1-Factors!$C$324)*Factors!$D$324*Factors!$G$324))*N2O_N2ON*GWP_N2O*mt_shortton","v":0},{"$f":"((E27*Factors!$B$325*(1-Factors!$C$325)*Factors!$E$325)+(E27*Factors!$B$325*Factors!$C$325*Factors!$F$325)+(E27*Factors!$B$325*(1-Factors!$C$325)*Factors!$D$325*Factors!$G$325))*N2O_N2ON*GWP_N2O*mt_shortton","v":0},0]
[null,{"$f":"'Background Controls'!I22","v":0},{"$f":"((C28*Factors!$B$323*(1-Factors!$C$323)*Factors!$E$323)+(C28*Factors!$B$323*Factors!$C$323*Factors!$F$323)+(C28*Factors!$B$323*(1-Factors!$C$323)*Factors!$D$323*Factors!$G$323))*N2O_N2ON*GWP_N2O*mt_shortton","v":0},{"$f":"((D28*Factors!$B$324*(1-Factors!$C$324)*Factors!$E$324)+(D28*Factors!$B$324*Factors!$C$324*Factors!$F$324)+(D28*Factors!$B$324*(1-Factors!$C$324)*Factors!$D$324*Factors!$G$324))*N2O_N2ON*GWP_N2O*mt_shortton","v":0},{"$f":"((E28*Factors!$B$325*(1-Factors!$C$325)*Factors!$E$325)+(E28*Factors!$B$325*Factors!$C$325*Factors!$F$325)+(E28*Factors!$B$325*(1-Factors!$C$325)*Factors!$D$325*Factors!$G$325))*N2O_N2ON*GWP_N2O*mt_shortton","v":0},0]
[null,{"$f":"'Background Controls'!I23","v":0},{"$f":"((C29*Factors!$B$323*(1-Factors!$C$323)*Factors!$E$323)+(C29*Factors!$B$323*Factors!$C$323*Factors!$F$323)+(C29*Factors!$B$323*(1-Factors!$C$323)*Factors!$D$323*Factors!$G$323))*N2O_N2ON*GWP_N2O*mt_shortton","v":0},{"$f":"((D29*Factors!$B$324*(1-Factors!$C$324)*Factors!$E$324)+(D29*Factors!$B$324*Factors!$C$324*Factors!$F$324)+(D29*Factors!$B$324*(1-Factors!$C$324)*Factors!$D$324*Factors!$G$324))*N2O_N2ON*GWP_N2O*mt_shortton","v":0},{"$f":"((E29*Factors!$B$325*(1-Factors!$C$325)*Factors!$E$325)+(E29*Factors!$B$325*Factors!$C$325*Factors!$F$325)+(E29*Factors!$B$325*(1-Factors!$C$325)*Factors!$D$325*Factors!$G$325))*N2O_N2ON*GWP_N2O*mt_shortton","v":0},0]
[null,{"$f":"'Background Controls'!I24","v":0},{"$f":"((C30*Factors!$B$323*(1-Factors!$C$323)*Factors!$E$323)+(C30*Factors!$B$323*Factors!$C$323*Factors!$F$323)+(C30*Factors!$B$323*(1-Factors!$C$323)*Factors!$D$323*Factors!$G$323))*N2O_N2ON*GWP_N2O*mt_shortton","v":0},{"$f":"((D30*Factors!$B$324*(1-Factors!$C$324)*Factors!$E$324)+(D30*Factors!$B$324*Factors!$C$324*Factors!$F$324)+(D30*Factors!$B$324*(1-Factors!$C$324)*Factors!$D$324*Factors!$G$324))*N2O_N2ON*GWP_N2O*mt_shortton","v":0},{"$f":"((E30*Factors!$B$325*(1-Factors!$C$325)*Factors!$E$325)+(E30*Factors!$B$325*Factors!$C$325*Factors!$F$325)+(E30*Factors!$B$325*(1-Factors!$C$325)*Factors!$D$325*Factors!$G$325))*N2O_N2ON*GWP_N2O*mt_shortton","v":0},0]
[null,"Total Emissions from Fertilizer Application",{"$f":"IF(ISERROR(SUM(C36:C55)),\"\",SUM(C36:C55))","v":0},{"$f":"IF(ISERROR(SUM(D36:D55)),\"\",SUM(D36:D55))","v":0},{"$f":"IF(ISERROR(SUM(E36:E55)),\"\",SUM(E36:E55))","v":0},{"$f":"IF(ISERROR(SUM(F36:F55)),\"\",SUM(F36:F55))","v":0}]
[]
[]
[]
[]
[]
[]
[]
[]
[]
[]
[]
[]
["Tribal GHG Inventory Tool: Government Operations Module"]

{"sheet":"Urban Forestry","index":27,"n_rows":69,"n_cols":4,"rows_kept":69,"cut":false,"hidden":false,"merged":[[68,0,68,21],[34,1,34,3]]}
["Urban Forestry"]
[]
[]
[]
[]
[]
["1. Enter Forestry Data"]
["Please enter the total urban area and percent of that area with tree cover below in your locality."]
[]
[null,"Department","Total Urban Area (km2)","% Urban Area with Tree Cover"]
["Dstart",{"$f":"'Background Controls'!I5","v":0}]
[null,{"$f":"'Background Controls'!I6","v":0}]
[null,{"$f":"'Background Controls'!I7","v":0}]
[null,{"$f":"'Background Controls'!I8","v":0}]
[null,{"$f":"'Background Controls'!I9","v":0}]
[null,{"$f":"'Background Controls'!I10","v":0}]
[null,{"$f":"'Background Controls'!I11","v":0}]
[null,{"$f":"'Background Controls'!I12","v":0}]
[null,{"$f":"'Background Controls'!I13","v":0}]
[null,{"$f":"'Background Controls'!I14","v":0}]
[null,{"$f":"'Background Controls'!I15","v":0}]
[null,{"$f":"'Background Controls'!I16","v":0}]
[null,{"$f":"'Background Controls'!I17","v":0}]
[null,{"$f":"'Background Controls'!I18","v":0}]
[null,{"$f":"'Background Controls'!I19","v":0}]
[null,{"$f":"'Background Controls'!I20","v":0}]
[null,{"$f":"'Background Controls'!I21","v":0}]
[null,{"$f":"'Background Controls'!I22","v":0}]
[null,{"$f":"'Background Controls'!I23","v":0}]
[null,{"$f":"'Background Controls'!I24","v":0}]
[]
[]
["Urban Forestry Carbon Sequestration Summary"]
[]
[null,"Carbon Sequestered (MT CO2e)"]
[null,null,"Carbon Sequestration","TOTAL"]
["Dstart",{"$f":"'Background Controls'!I5","v":0},{"$f":"((C11*D11*Factors!$B$331*100)*44/12)","v":0},{"$f":"C37","v":0}]
[null,{"$f":"'Background Controls'!I6","v":0},{"$f":"((C12*D12*Factors!$B$331*100)*44/12)","v":0},{"$f":"C38","v":0}]
[null,{"$f":"'Background Controls'!I7","v":0},{"$f":"((C13*D13*Factors!$B$331*100)*44/12)","v":0},0]
[null,{"$f":"'Background Controls'!I8","v":0},{"$f":"((C14*D14*Factors!$B$331*100)*44/12)","v":0},0]
[null,{"$f":"'Background Controls'!I9","v":0},{"$f":"((C15*D15*Factors!$B$331*100)*44/12)","v":0},0]
[null,{"$f":"'Background Controls'!I10","v":0},{"$f":"((C16*D16*Factors!$B$331*100)*44/12)","v":0},0]
[null,{"$f":"'Background Controls'!I11","v":0},{"$f":"((C17*D17*Factors!$B$331*100)*44/12)","v":0},0]
[null,{"$f":"'Background Controls'!I12","v":0},{"$f":"((C18*D18*Factors!$B$331*100)*44/12)","v":0},0]
[null,{"$f":"'Background Controls'!I13","v":0},{"$f":"((C19*D19*Factors!$B$331*100)*44/12)","v":0},0]
[null,{"$f":"'Background Controls'!I14","v":0},{"$f":"((C20*D20*Factors!$B$331*100)*44/12)","v":0},0]
[null,{"$f":"'Background Controls'!I15","v":0},{"$f":"((C21*D21*Factors!$B$331*100)*44/12)","v":0},0]
[null,{"$f":"'Background Controls'!I16","v":0},{"$f":"((C22*D22*Factors!$B$331*100)*44/12)","v":0},0]
[null,{"$f":"'Background Controls'!I17","v":0},{"$f":"((C23*D23*Factors!$B$331*100)*44/12)","v":0},0]
[null,{"$f":"'Background Controls'!I18","v":0},{"$f":"((C24*D24*Factors!$B$331*100)*44/12)","v":0},0]
[null,{"$f":"'Background Controls'!I19","v":0},{"$f":"((C25*D25*Factors!$B$331*100)*44/12)","v":0},0]
[null,{"$f":"'Background Controls'!I20","v":0},{"$f":"((C26*D26*Factors!$B$331*100)*44/12)","v":0},0]
[null,{"$f":"'Background Controls'!I21","v":0},{"$f":"((C27*D27*Factors!$B$331*100)*44/12)","v":0},0]
[null,{"$f":"'Background Controls'!I22","v":0},{"$f":"((C28*D28*Factors!$B$331*100)*44/12)","v":0},0]
[null,{"$f":"'Background Controls'!I23","v":0},{"$f":"((C29*D29*Factors!$B$331*100)*44/12)","v":0},0]
[null,{"$f":"'Background Controls'!I24","v":0},{"$f":"((C30*D30*Factors!$B$331*100)*44/12)","v":0},0]
[null,"Total Sequestration from Urban Trees",{"$f":"IF(ISERROR(SUM(C37:C56)),\"\",SUM(C37:C56))","v":0},{"$f":"C57","v":0}]
[]
[]
[]
[]
[]
[]
[]
[]
[]
[]
[]
["Tribal GHG Inventory Tool: Government Operations Module"]

{"sheet":"Waste Production","index":28,"n_rows":41,"n_cols":4,"rows_kept":41,"cut":false,"hidden":false,"merged":[[8,1,8,3],[40,0,40,13]]}
["Waste Generation"]
[]
[]
[null,"To calculate Scope 3 emissions from waste, please visit  EPA's WAste Reduction Model (WARM). WARM is available both as a web-based calculator and in an Excel spreadsheet."]
[null,"http://www.epa.gov/climatechange/wycd/waste/calculators/Warm_home.html"]
[]
[{"$f":"IF('Solid Waste-Control'!$A$10=2, \"Show\", \"Hide\")","v":"Hide"},"Please enter the results from EPA's WARM model here. "]
[{"$f":"IF('Solid Waste-Control'!$A$10=2, \"Show\", \"Hide\")","v":"Hide"}]
[{"$f":"IF('Solid Waste-Control'!$A$10=2, \"Show\", \"Hide\")","v":"Hide"},"Enter value from Baseline Waste Management Scenario."]
[{"$f":"IF('Solid Waste-Control'!$A$10=2, \"Show\", \"Hide\")","v":"Hide"}]
[{"$f":"IF('Solid Waste-Control'!$A$10=2, \"Show\", \"Hide\")","v":"Hide"},"Solid Waste Emissions (Scope 3)",null,"MT CO2e"]
[{"$f":"IF('Solid Waste-Control'!$A$10=2, \"Show\", \"Hide\")","v":"Hide"}]
[{"$f":"IF('Solid Waste-Control'!$A$10=2, \"Show\", \"Hide\")","v":"Hide"}]
[{"$f":"IF('Solid Waste-Control'!$A$10=2, \"Show\", \"Hide\")","v":"Hide"},"Please also describe how you would like these emissions to be allocated by department."]
[{"$f":"IF('Solid Waste-Control'!$A$10=2, \"Show\", \"Hide\")","v":"Hide"},"For example, enter or estimate the percentage of total waste that comes from each department, or use department size as a proxy."]
[{"$f":"IF('Solid Waste-Control'!$A$10=2, \"Show\", \"Hide\")","v":"Hide"},"Department","Contribution to Total Waste (%)","MT CO2e"]
[{"$f":"IF('Solid Waste-Control'!$A$10=2, \"Dstart\", \"Hide\")","v":"Hide"},{"$f":"'Background Controls'!I5","v":0},null,{"$f":"$C$11*C17","v":0}]
[{"$f":"IF('Solid Waste-Control'!$A$10=2, \"Show\", \"Hide\")","v":"Hide"},{"$f":"'Background Controls'!I6","v":0},null,{"$f":"$C$11*C18","v":0}]
[{"$f":"IF('Solid Waste-Control'!$A$10=2, \"Show\", \"Hide\")","v":"Hide"},{"$f":"'Background Controls'!I7","v":0},null,0]
[{"$f":"IF('Solid Waste-Control'!$A$10=2, \"Show\", \"Hide\")","v":"Hide"},{"$f":"'Background Controls'!I8","v":0},null,0]
[{"$f":"IF('Solid Waste-Control'!$A$10=2, \"Show\", \"Hide\")","v":"Hide"},{"$f":"'Background Controls'!I9","v":0},null,0]
[{"$f":"IF('Solid Waste-Control'!$A$10=2, \"Show\", \"Hide\")","v":"Hide"},{"$f":"'Background Controls'!I10","v":0},null,0]
[{"$f":"IF('Solid Waste-Control'!$A$10=2, \"Show\", \"Hide\")","v":"Hide"},{"$f":"'Background Controls'!I11","v":0},null,0]
[{"$f":"IF('Solid Waste-Control'!$A$10=2, \"Show\", \"Hide\")","v":"Hide"},{"$f":"'Background Controls'!I12","v":0},null,0]
[{"$f":"IF('Solid Waste-Control'!$A$10=2, \"Show\", \"Hide\")","v":"Hide"},{"$f":"'Background Controls'!I13","v":0},null,0]
[{"$f":"IF('Solid Waste-Control'!$A$10=2, \"Show\", \"Hide\")","v":"Hide"},{"$f":"'Background Controls'!I14","v":0},null,0]
[{"$f":"IF('Solid Waste-Control'!$A$10=2, \"Show\", \"Hide\")","v":"Hide"},{"$f":"'Background Controls'!I15","v":0},null,0]
[{"$f":"IF('Solid Waste-Control'!$A$10=2, \"Show\", \"Hide\")","v":"Hide"},{"$f":"'Background Controls'!I16","v":0},null,0]
[{"$f":"IF('Solid Waste-Control'!$A$10=2, \"Show\", \"Hide\")","v":"Hide"},{"$f":"'Background Controls'!I17","v":0},null,0]
[{"$f":"IF('Solid Waste-Control'!$A$10=2, \"Show\", \"Hide\")","v":"Hide"},{"$f":"'Background Controls'!I18","v":0},null,0]
[{"$f":"IF('Solid Waste-Control'!$A$10=2, \"Show\", \"Hide\")","v":"Hide"},{"$f":"'Background Controls'!I19","v":0},null,0]
[{"$f":"IF('Solid Waste-Control'!$A$10=2, \"Show\", \"Hide\")","v":"Hide"},{"$f":"'Background Controls'!I20","v":0},null,0]
[{"$f":"IF('Solid Waste-Control'!$A$10=2, \"Show\", \"Hide\")","v":"Hide"},{"$f":"'Background Controls'!I21","v":0},null,0]
[{"$f":"IF('Solid Waste-Control'!$A$10=2, \"Show\", \"Hide\")","v":"Hide"},{"$f":"'Background Controls'!I22","v":0},null,0]
[{"$f":"IF('Solid Waste-Control'!$A$10=2, \"Show\", \"Hide\")","v":"Hide"},{"$f":"'Background Controls'!I23","v":0},null,0]
[{"$f":"IF('Solid Waste-Control'!$A$10=2, \"Show\", \"Hide\")","v":"Hide"},{"$f":"'Background Controls'!I24","v":0},null,0]
[{"$f":"IF('Solid Waste-Control'!$A$10=2, \"Show\", \"Hide\")","v":"Hide"},"Total",{"$f":"SUM(C17:C36)","v":0},{"$f":"SUM(D17:D36)","v":0}]
[{"$f":"IF('Solid Waste-Control'!$A$10=2, \"Show\", \"Hide\")","v":"Hide"}]
[]
[]
["Tribal GHG Inventory Tool: Government Operations Module"]

{"sheet":"Additional Emission Sources","index":29,"n_rows":29,"n_cols":17,"rows_kept":29,"cut":false,"hidden":false,"merged":[[13,4,13,10],[28,0,28,14]]}
["Additional Emission Sources"]
[]
[]
[]
[]
[]
[]
[]
[2,"1) Would you like to add any additional emission sources?",null,null,null,null,null,null,null,null,null,null,null,null,null,null,1]
[]
[{"$f":"IF($Q$9=2, \"Show\", \"Hide\")","v":"Hide"}]
[{"$f":"IF($Q$9=2, \"Show\", \"Hide\")","v":"Hide"},"2) Add up to a maximum of 10 emission sources below."]
[{"$f":"IF($Q$9=2, \"Show\", \"Hide\")","v":"Hide"}]
[{"$f":"IF($Q$9=2, \"Show\", \"Hide\")","v":"Hide"},null,null,null,"MT CO2e"]
["Hide","Description","Department","Scope","CO2","CH4","N2O","HFCs","PFCs","SF6","Total"]
["Hide",null,null,null,null,null,null,null,null,null,{"$f":"SUM(E16:J16)","v":0},1]
["Hide",null,null,null,null,null,null,null,null,null,0,2]
["Hide",null,null,null,null,null,null,null,null,null,0,3]
["Hide",null,null,null,null,null,null,null,null,null,0,4]
["Hide",null,null,null,null,null,null,null,null,null,0,5]
["Hide",null,null,null,null,null,null,null,null,null,0,6]
["Hide",null,null,null,null,null,null,null,null,null,0,7]
["Hide",null,null,null,null,null,null,null,null,null,0,8]
["Hide",null,null,null,null,null,null,null,null,null,0,9]
["Hide",null,null,null,null,null,null,null,null,null,0,10]
["Hide"]
[]
[]
["Tribal GHG Inventory Tool: Government Operations Module"]

{"sheet":"Summary-Emissions","index":30,"n_rows":151,"n_cols":24,"rows_kept":151,"cut":false,"hidden":false,"merged":[[10,1,10,9],[40,1,40,3],[2,1,2,9],[113,0,113,20],[87,1,87,13]]}
["Inventory Emissions Summary"]
[null,null,null,null,null,{"$f":"IF(SUM('Additional Emission Sources'!H16:H25)>0, \"Show\", \"Hide\")","v":"Hide"},{"$f":"IF(SUM('Additional Emission Sources'!I16:I25)>0, \"Show\", \"Hide\")","v":"Hide"},{"$f":"IF(SUM('Additional Emission Sources'!J16:J25)>0, \"Show\", \"Hide\")","v":"Hide"}]
[null,{"$f":" \"Total \" &MyCity &\" Emissions\"","v":"Total  Emissions"},null,null,null,null,null,null,null,null,null,null,{"$f":"IF(ISERROR(I24/myPopulation),0,I24/myPopulation)","v":0},{"$f":"\"Per capita Emissions for\"&MyCity &\"  (MT CO2e/person) \"","v":"Per capita Emissions for  (MT CO2e/person) "}]
[null,null,"CO2","CH4","N2O","HFCs","PFCs","SF6","Total MT CO2e","Percent of Total"]
[null,"Scope 1",{"$f":"SUMIF($A$13:$A$23, RIGHT($B5, 1), C$13:C$23)+SUMIF('Additional Emission Sources'!$D$16:$D$25,  RIGHT($B5,1), 'Additional Emission Sources'!E$16:E$25)","v":0},{"$f":"SUMIF($A$13:$A$23, RIGHT($B5, 1), D$13:D$23)+SUMIF('Additional Emission Sources'!$D$16:$D$25,  RIGHT($B5,1), 'Additional Emission Sources'!F$16:F$25)","v":0},{"$f":"SUMIF($A$13:$A$23, RIGHT($B5, 1), E$13:E$23)+SUMIF('Additional Emission Sources'!$D$16:$D$25,  RIGHT($B5,1), 'Additional Emission Sources'!G$16:G$25)","v":0},{"$f":"SUMIF('Additional Emission Sources'!$D$16:$D$25,  RIGHT($B5,1), 'Additional Emission Sources'!H$16:H$25)","v":0},{"$f":"SUMIF('Additional Emission Sources'!$D$16:$D$25,  RIGHT($B5,1), 'Additional Emission Sources'!I$16:I$25)","v":0},{"$f":"SUMIF('Additional Emission Sources'!$D$16:$D$25,  RIGHT($B5,1), 'Additional Emission Sources'!J$16:J$25)","v":0},{"$f":"SUM(C5:H5)","v":0},{"$f":"IF($I$8=0,0,I5/$I$8)","v":0}]
[null,"Scope 2",{"$f":"SUMIF($A$13:$A$23, RIGHT($B6, 1), C$13:C$23)+SUMIF('Additional Emission Sources'!$D$16:$D$25,  RIGHT($B6,1), 'Additional Emission Sources'!E$16:E$25)","v":0},{"$f":"SUMIF($A$13:$A$23, RIGHT($B6, 1), D$13:D$23)+SUMIF('Additional Emission Sources'!$D$16:$D$25,  RIGHT($B6,1), 'Additional Emission Sources'!F$16:F$25)","v":0},{"$f":"SUMIF($A$13:$A$23, RIGHT($B6, 1), E$13:E$23)+SUMIF('Additional Emission Sources'!$D$16:$D$25,  RIGHT($B6,1), 'Additional Emission Sources'!G$16:G$25)","v":0},{"$f":"SUMIF('Additional Emission Sources'!$D$16:$D$25,  RIGHT($B6,1), 'Additional Emission Sources'!H$16:H$25)","v":0},{"$f":"SUMIF('Additional Emission Sources'!$D$16:$D$25,  RIGHT($B6,1), 'Additional Emission Sources'!I$16:I$25)","v":0},{"$f":"SUMIF('Additional Emission Sources'!$D$16:$D$25,  RIGHT($B6,1), 'Additional Emission Sources'!J$16:J$25)","v":0},{"$f":"SUM(C6:H6)","v":0},{"$f":"IF($I$8=0,0,I6/$I$8)","v":0}]
[null,"Scope 3",{"$f":"SUMIF($A$13:$A$23, RIGHT($B7, 1), C$13:C$23)+SUMIF('Additional Emission Sources'!$D$16:$D$25,  RIGHT($B7,1), 'Additional Emission Sources'!E$16:E$25)","v":0},{"$f":"SUMIF($A$13:$A$23, RIGHT($B7, 1), D$13:D$23)+SUMIF('Additional Emission Sources'!$D$16:$D$25,  RIGHT($B7,1), 'Additional Emission Sources'!F$16:F$25)","v":0},{"$f":"SUMIF($A$13:$A$23, RIGHT($B7, 1), E$13:E$23)+SUMIF('Additional Emission Sources'!$D$16:$D$25,  RIGHT($B7,1), 'Additional Emission Sources'!G$16:G$25)","v":0},{"$f":"SUMIF('Additional Emission Sources'!$D$16:$D$25,  RIGHT($B7,1), 'Additional Emission Sources'!H$16:H$25)","v":0},{"$f":"SUMIF('Additional Emission Sources'!$D$16:$D$25,  RIGHT($B7,1), 'Additional Emission Sources'!I$16:I$25)","v":0},{"$f":"SUMIF('Additional Emission Sources'!$D$16:$D$25,  RIGHT($B7,1), 'Additional Emission Sources'!J$16:J$25)","v":0},0,{"$f":"IF($I$8=0,0,I7/$I$8)","v":0}]
[null,"Total Gross Emissions",{"$f":"SUM(C5:C6)+ SUMIF($A$13:$A$20, RIGHT($B7, 1), C$13:C$20)+SUMIF($A$22, RIGHT($B7, 1), C$22)+SUMIF('Additional Emission Sources'!$D$16:$D$25,  RIGHT($B7,1), 'Additional Emission Sources'!E$16:E$25)","v":0},{"$f":"SUM(D5:D7)","v":0},0,0,0,0,{"$f":"SUM(C8:E8)","v":0},{"$f":"SUM(J5:J7)","v":0}]
[null,"Total Net Emissions",{"$f":"SUM(C5:C7)","v":0},{"$f":"SUM(D5:D7)","v":0},{"$f":"SUM(E5:E7)","v":0},0,0,0,{"$f":"SUM(C9:E9)","v":0},{"$f":"SUM(J5:J7)","v":0}]
[]
[null,"Emissions by Source (MT CO2e)"]
["Scope","Source","CO2","CH4","N2O","HFCs","PFCs","SF6","Total","Percent of Total"]
[1,"Stationary Combustion",{"$f":"'Stationary-Calcs'!C43","v":0},{"$f":"'Stationary-Calcs'!D43","v":0},{"$f":"'Stationary-Calcs'!E43","v":0},"-","-","-",{"$f":"SUM(C13:H13)","v":0},{"$f":"IF($I$8=0,0,I13/$I$8)","v":0},null,null,null,null,null,null,null,null,null,null,null,null,null,{"$f":"B13&\" (\"&TEXT(J13,\"#0%)\")","v":"Stationary Combustion (0%)"}]
[1,"Mobile Combustion",{"$f":"'Mobile-Summary'!C27","v":0},{"$f":"'Mobile-Summary'!D27","v":0},{"$f":"'Mobile-Summary'!E27","v":0},"-","-","-",{"$f":"SUM(C14:H14)","v":0},0,null,null,null,null,null,null,null,null,null,null,null,null,null,{"$f":"B14&\" (\"&TEXT(J14,\"#0%)\")","v":"Mobile Combustion (0%)"}]
[1,"Solid Waste","-",{"$f":"'Solid Waste-Entry'!$C$80","v":0},"-","-","-","-",0,0,null,null,null,null,null,null,null,null,null,null,null,null,null,{"$f":"B15&\" (\"&TEXT(J15,\"#0%)\")","v":"Solid Waste (0%)"}]
[1,"Wastewater Treatment","-",{"$f":"'Wastewater- Calcs'!D15","v":0},{"$f":"'Wastewater- Calcs'!D16","v":0},"-","-","-",0,0,null,null,null,null,null,null,null,null,null,null,null,null,null,{"$f":"B16&\" (\"&TEXT(J16,\"#0%)\")","v":"Wastewater Treatment (0%)"}]
[2,"Electricity",{"$f":"'Electricity-Calcs'!C40","v":0},{"$f":"'Electricity-Calcs'!D40","v":0},{"$f":"'Electricity-Calcs'!E40","v":0},"-","-","-",{"$f":"SUM(C17:H17)","v":0},{"$f":"IF($I$8=0,0,I17/$I$8)","v":0},null,null,null,null,null,null,null,null,null,null,null,null,null,{"$f":"B17&\" (\"&TEXT(J17,\"#0%)\")","v":"Electricity (0%)"}]
[3,"Employee Commute",{"$f":"'Employee Commute'!C83","v":0},"-","-","-","-","-",0,0,null,null,null,null,null,null,null,null,null,null,null,null,null,{"$f":"B18&\" (\"&TEXT(J18,\"#0%)\")","v":"Employee Commute (0%)"}]
[3,"Water",{"$f":"Water!C73","v":0},{"$f":"Water!D73","v":0},{"$f":"Water!E73","v":0},"-","-","-",0,0,null,null,null,null,null,null,null,null,null,null,null,null,null,"Water (0%)"]
[3,"Ag & Land Management","-","-",{"$f":"'Agriculture & Land Management'!F56","v":0},null,null,null,0,0,null,null,null,null,null,null,null,null,null,null,null,null,null,"Ag & Land Management (0%)"]
[3,"Urban Forestry",{"$f":"-'Urban Forestry'!D57","v":0},"-","-",null,null,null,0,0,null,null,null,null,null,null,null,null,null,null,null,null,null,"Urban Forestry (0%)"]
[3,"Waste Generation","-",{"$f":"'Waste Production'!C11","v":0},"-",null,null,null,0,0,null,null,null,null,null,null,null,null,null,null,null,null,null,"Waste Generation (0%)"]
[{"$f":"IF(SUM('Additional Emission Sources'!K16:K25)>0, \"Show\", \"Hide\")","v":"Hide"},"Other",{"$f":"SUM('Additional Emission Sources'!E16:E25)","v":0},{"$f":"SUM('Additional Emission Sources'!F16:F25)","v":0},{"$f":"SUM('Additional Emission Sources'!G16:G25)","v":0},{"$f":"SUM('Additional Emission Sources'!H16:H25)","v":0},{"$f":"SUM('Additional Emission Sources'!I16:I25)","v":0},{"$f":"SUM('Additional Emission Sources'!J16:J25)","v":0},0,{"$f":"IFERROR(I23/$I$8,0)","v":0},null,null,null,null,null,null,null,null,null,null,null,null,null,"Other (0%)"]
[null,"Total (Gross Emissions)",{"$f":"SUM(C13:C20,C22:C23)","v":0},{"$f":"SUM(D13:D20,D22:D23)","v":0},0,{"$f":"SUM(F13:F23)","v":0},0,0,{"$f":"SUM(I13:I20,I22:I23)","v":0},{"$f":"IF($I$8=0,0,I24/$I$8)","v":0}]
[null,"Total (Net Emissions)",{"$f":"SUM(C13:C22)","v":0},{"$f":"SUM(D13:D22)","v":0},{"$f":"SUM(E13:E22)","v":0},null,null,null,{"$f":"SUM(I13:I22)","v":0}]
[]
[]
[]
[]
[]
[]
[]
[]
[]
[]
[]
[]
[]
[]
[]
[null,"Gross Emissions by Department"]
[null,"Department","Total Total (MT CO2e)","Percent of Total"]
["Dstart",{"$f":"'Background Controls'!I5","v":0},{"$f":"SUMIF($B$129:$B$150, B43, $N$129:$N$150)","v":0},{"$f":"IF($I$8=0,0,C43/$I$8)","v":0},null,null,null,null,null,null,null,null,null,null,null,null,null,null,null,null,null,null,null,{"$f":"B43&\" (\"&TEXT(D43,\"#0%)\")","v":"0 (0%)"}]
[null,{"$f":"'Background Controls'!I6","v":0},0,0,null,null,null,null,null,null,null,null,null,null,null,null,null,null,null,null,null,null,null,"0 (0%)"]
[null,{"$f":"'Background Controls'!I7","v":0},0,0,null,null,null,null,null,null,null,null,null,null,null,null,null,null,null,null,null,null,null,"0 (0%)"]
[null,{"$f":"'Background Controls'!I8","v":0},0,0,null,null,null,null,null,null,null,null,null,null,null,null,null,null,null,null,null,null,null,"0 (0%)"]
[null,{"$f":"'Background Controls'!I9","v":0},0,0,null,null,null,null,null,null,null,null,null,null,null,null,null,null,null,null,null,null,null,"0 (0%)"]
[null,{"$f":"'Background Controls'!I10","v":0},0,0,null,null,null,null,null,null,null,null,null,null,null,null,null,null,null,null,null,null,null,"0 (0%)"]
[null,{"$f":"'Background Controls'!I11","v":0},0,0,null,null,null,null,null,null,null,null,null,null,null,null,null,null,null,null,null,null,null,"0 (0%)"]
[null,{"$f":"'Background Controls'!I12","v":0},0,0,null,null,null,null,null,null,null,null,null,null,null,null,null,null,null,null,null,null,null,"0 (0%)"]
[null,{"$f":"'Background Controls'!I13","v":0},0,0,null,null,null,null,null,null,null,null,null,null,null,null,null,null,null,null,null,null,null,"0 (0%)"]
[null,{"$f":"'Background Controls'!I14","v":0},0,0,null,null,null,null,null,null,null,null,null,null,null,null,null,null,null,null,null,null,null,"0 (0%)"]
[null,{"$f":"'Background Controls'!I15","v":0},0,0,null,null,null,null,null,null,null,null,null,null,null,null,null,null,null,null,null,null,null,"0 (0%)"]
[null,{"$f":"'Background Controls'!I16","v":0},0,0,null,null,null,null,null,null,null,null,null,null,null,null,null,null,null,null,null,null,null,"0 (0%)"]
[null,{"$f":"'Background Controls'!I17","v":0},0,0,null,null,null,null,null,null,null,null,null,null,null,null,null,null,null,null,null,null,null,"0 (0%)"]
[null,{"$f":"'Background Controls'!I18","v":0},0,0,null,null,null,null,null,null,null,null,null,null,null,null,null,null,null,null,null,null,null,"0 (0%)"]
[null,{"$f":"'Background Controls'!I19","v":0},0,0,null,null,null,null,null,null,null,null,null,null,null,null,null,null,null,null,null,null,null,"0 (0%)"]
[null,{"$f":"'Background Controls'!I20","v":0},0,0,null,null,null,null,null,null,null,null,null,null,null,null,null,null,null,null,null,null,null,"0 (0%)"]
[null,{"$f":"'Background Controls'!I21","v":0},0,0,null,null,null,null,null,null,null,null,null,null,null,null,null,null,null,null,null,null,null,"0 (0%)"]
[null,{"$f":"'Background Controls'!I22","v":0},0,0,null,null,null,null,null,null,null,null,null,null,null,null,null,null,null,null,null,null,null,"0 (0%)"]
[null,{"$f":"'Background Controls'!I23","v":0},0,0,null,null,null,null,null,null,null,null,null,null,null,null,null,null,null,null,null,null,null,"0 (0%)"]
[null,{"$f":"'Background Controls'!I24","v":0},0,0,null,null,null,null,null,null,null,null,null,null,null,null,null,null,null,null,null,null,null,"0 (0%)"]
[null,"Total",{"$f":"SUM(C43:C62)","v":0},{"$f":"SUM(D43:D62)","v":0},null,null,null,null,null,null,null,null,null,null,null,null,null,null,null,null,null,null,null,"Total (0%)"]
[]
[]
[]
[]
[]
[]
[]
[]
[]
[]
[]
[]
[]
[]
[]
[]
[]
[]
[]
[]
[]
[]
[]
[]
[null,"Total Emissions by Department and Source (MT CO2e)"]
[null,"Department","Stationary","Electricity","Mobile","Solid Waste","Waste\nwater","Employee Commute","Water","Agriculture & Land Management","Urban Forestry","Other","TOTAL GROSS","TOTAL NET"]
["Dstart",{"$f":"'Background Controls'!I5","v":0},{"$f":"C129","v":0},{"$f":"G129","v":0},{"$f":"D129","v":0},{"$f":"IF(B$149=$B90, L129+E$149, L129)","v":0},{"$f":"IF(B$150=$B90, F129+F$150, F129)","v":0},{"$f":"H129","v":0},0,{"$f":"J129","v":0},{"$f":"K129","v":0},{"$f":"M129","v":0},{"$f":"SUM(C90:J90,L90)","v":0},{"$f":"SUM(C90:L90)","v":0}]
[null,{"$f":"'Background Controls'!I6","v":0},{"$f":"C130","v":0},0,{"$f":"D130","v":0},0,0,{"$f":"H130","v":0},0,0,0,0,{"$f":"SUM(C91:J91,L91)","v":0},{"$f":"SUM(C91:L91)","v":0}]
[null,{"$f":"'Background Controls'!I7","v":0},0,0,0,0,0,{"$f":"H131","v":0},0,0,0,0,0,0]
[null,{"$f":"'Background Controls'!I8","v":0},0,0,0,0,0,{"$f":"H132","v":0},0,0,0,0,0,0]
[null,{"$f":"'Background Controls'!I9","v":0},0,0,0,0,0,{"$f":"H133","v":0},0,0,0,0,0,0]
[null,{"$f":"'Background Controls'!I10","v":0},0,0,0,0,0,{"$f":"H134","v":0},0,0,0,0,0,0]
[null,{"$f":"'Background Controls'!I11","v":0},0,0,0,0,0,{"$f":"H135","v":0},0,0,0,0,0,0]
[null,{"$f":"'Background Controls'!I12","v":0},0,0,0,0,0,{"$f":"H136","v":0},0,0,0,0,0,0]
[null,{"$f":"'Background Controls'!I13","v":0},0,0,0,0,0,{"$f":"H137","v":0},0,0,0,0,0,0]
[null,{"$f":"'Background Controls'!I14","v":0},0,0,0,0,0,{"$f":"H138","v":0},0,0,0,0,0,0]
[null,{"$f":"'Background Controls'!I15","v":0},0,0,0,0,0,{"$f":"H139","v":0},0,0,0,0,0,0]
[null,{"$f":"'Background Controls'!I16","v":0},0,0,0,0,0,{"$f":"H140","v":0},0,0,0,0,0,0]
[null,{"$f":"'Background Controls'!I17","v":0},0,0,0,0,0,{"$f":"H141","v":0},0,0,0,0,0,0]
[null,{"$f":"'Background Controls'!I18","v":0},0,0,0,0,0,{"$f":"H142","v":0},0,0,0,0,0,0]
[null,{"$f":"'Background Controls'!I19","v":0},0,0,0,0,0,{"$f":"H143","v":0},0,0,0,0,0,0]
[null,{"$f":"'Background Controls'!I20","v":0},0,0,0,0,0,{"$f":"H144","v":0},0,0,0,0,0,0]
[null,{"$f":"'Background Controls'!I21","v":0},0,0,0,0,0,{"$f":"H145","v":0},0,0,0,0,0,0]
[null,{"$f":"'Background Controls'!I22","v":0},0,0,0,0,0,{"$f":"H146","v":0},0,0,0,0,0,0]
[null,{"$f":"'Background Controls'!I23","v":0},0,0,0,0,0,{"$f":"H147","v":0},0,0,0,0,0,0]
[null,{"$f":"'Background Controls'!I24","v":0},0,0,0,0,0,{"$f":"H148","v":0},0,0,0,0,0,0]
[null,"Total",{"$f":"SUM(C90:C109)","v":0},{"$f":"SUM(D90:D109)","v":0},0,0,0,0,0,0,0,{"$f":"SUM(L90:L109)","v":0},{"$f":"SUM(M90:M109)","v":0},{"$f":"SUM(N90:N109)","v":0}]
[]
[]
[]
["Tribal GHG Inventory Tool: Government Operations Module"]
[]
[]
[]
[]
[]
[]
[]
[]
[]
[]
[]
[]
[null,"Total Emissions by Department by Source"]
[null,null,"Stationary","Mobile","Solid Waste","Waste-water","Electricity","Employee Commute","Water","Ag & Land Management","Urban Forestry","Waste Generation","Other","TOTAL Gross","TOTAL Net"]
["Dstart",{"$f":"'Background Controls'!I5","v":0},{"$f":"'Stationary-Calcs'!F23","v":0},{"$f":"'Mobile-Summary'!F7","v":0},null,null,{"$f":"'Electricity-Calcs'!F20","v":0},{"$f":"'Employee Commute'!C63","v":0},{"$f":"Water!F53","v":0},{"$f":"'Agriculture & Land Management'!F36","v":0},{"$f":"-'Urban Forestry'!D37","v":0},{"$f":"'Waste Production'!D17","v":0},{"$f":"SUMIF('Additional Emission Sources'!$C$16:$C$25, 'Summary-Emissions'!B129, 'Additional Emission Sources'!$K$16:$K$25)","v":0},{"$f":"SUM(C129:J129,L129:M129)","v":0},{"$f":"SUM(C129:M129)","v":0}]
[null,{"$f":"'Background Controls'!I6","v":0},{"$f":"'Stationary-Calcs'!F24","v":0},{"$f":"'Mobile-Summary'!F8","v":0},null,null,{"$f":"'Electricity-Calcs'!F21","v":0},{"$f":"'Employee Commute'!C64","v":0},{"$f":"Water!F54","v":0},{"$f":"'Agriculture & Land Management'!F37","v":0},{"$f":"-'Urban Forestry'!D38","v":0},{"$f":"'Waste Production'!D18","v":0},{"$f":"SUMIF('Additional Emission Sources'!$C$16:$C$25, 'Summary-Emissions'!B130, 'Additional Emission Sources'!$K$16:$K$25)","v":0},{"$f":"SUM(C130:J130,L130:M130)","v":0},{"$f":"SUM(C130:M130)","v":0}]
[null,{"$f":"'Background Controls'!I7","v":0},{"$f":"'Stationary-Calcs'!F25","v":0},{"$f":"'Mobile-Summary'!F9","v":0},null,null,{"$f":"'Electricity-Calcs'!F22","v":0},{"$f":"'Employee Commute'!C65","v":0},{"$f":"Water!F55","v":0},{"$f":"'Agriculture & Land Management'!F38","v":0},{"$f":"-'Urban Forestry'!D39","v":0},{"$f":"'Waste Production'!D19","v":0},{"$f":"SUMIF('Additional Emission Sources'!$C$16:$C$25, 'Summary-Emissions'!B131, 'Additional Emission Sources'!$K$16:$K$25)","v":0},0,0]
[null,{"$f":"'Background Controls'!I8","v":0},{"$f":"'Stationary-Calcs'!F26","v":0},{"$f":"'Mobile-Summary'!F10","v":0},null,null,{"$f":"'Electricity-Calcs'!F23","v":0},{"$f":"'Employee Commute'!C66","v":0},{"$f":"Water!F56","v":0},{"$f":"'Agriculture & Land Management'!F39","v":0},{"$f":"-'Urban Forestry'!D40","v":0},{"$f":"'Waste Production'!D20","v":0},{"$f":"SUMIF('Additional Emission Sources'!$C$16:$C$25, 'Summary-Emissions'!B132, 'Additional Emission Sources'!$K$16:$K$25)","v":0},0,0]
[null,{"$f":"'Background Controls'!I9","v":0},{"$f":"'Stationary-Calcs'!F27","v":0},{"$f":"'Mobile-Summary'!F11","v":0},null,null,{"$f":"'Electricity-Calcs'!F24","v":0},{"$f":"'Employee Commute'!C67","v":0},{"$f":"Water!F57","v":0},{"$f":"'Agriculture & Land Management'!F40","v":0},{"$f":"-'Urban Forestry'!D41","v":0},{"$f":"'Waste Production'!D21","v":0},{"$f":"SUMIF('Additional Emission Sources'!$C$16:$C$25, 'Summary-Emissions'!B133, 'Additional Emission Sources'!$K$16:$K$25)","v":0},0,0]
[null,{"$f":"'Background Controls'!I10","v":0},{"$f":"'Stationary-Calcs'!F28","v":0},{"$f":"'Mobile-Summary'!F12","v":0},null,null,{"$f":"'Electricity-Calcs'!F25","v":0},{"$f":"'Employee Commute'!C68","v":0},{"$f":"Water!F58","v":0},{"$f":"'Agriculture & Land Management'!F41","v":0},{"$f":"-'Urban Forestry'!D42","v":0},{"$f":"'Waste Production'!D22","v":0},{"$f":"SUMIF('Additional Emission Sources'!$C$16:$C$25, 'Summary-Emissions'!B134, 'Additional Emission Sources'!$K$16:$K$25)","v":0},0,0]
[null,{"$f":"'Background Controls'!I11","v":0},{"$f":"'Stationary-Calcs'!F29","v":0},{"$f":"'Mobile-Summary'!F13","v":0},null,null,{"$f":"'Electricity-Calcs'!F26","v":0},{"$f":"'Employee Commute'!C69","v":0},{"$f":"Water!F59","v":0},{"$f":"'Agriculture & Land Management'!F42","v":0},{"$f":"-'Urban Forestry'!D43","v":0},{"$f":"'Waste Production'!D23","v":0},{"$f":"SUMIF('Additional Emission Sources'!$C$16:$C$25, 'Summary-Emissions'!B135, 'Additional Emission Sources'!$K$16:$K$25)","v":0},0,0]
[null,{"$f":"'Background Controls'!I12","v":0},{"$f":"'Stationary-Calcs'!F30","v":0},{"$f":"'Mobile-Summary'!F14","v":0},null,null,{"$f":"'Electricity-Calcs'!F27","v":0},{"$f":"'Employee Commute'!C70","v":0},{"$f":"Water!F60","v":0},{"$f":"'Agriculture & Land Management'!F43","v":0},{"$f":"-'Urban Forestry'!D44","v":0},{"$f":"'Waste Production'!D24","v":0},{"$f":"SUMIF('Additional Emission Sources'!$C$16:$C$25, 'Summary-Emissions'!B136, 'Additional Emission Sources'!$K$16:$K$25)","v":0},0,0]
[null,{"$f":"'Background Controls'!I13","v":0},{"$f":"'Stationary-Calcs'!F31","v":0},{"$f":"'Mobile-Summary'!F15","v":0},null,null,{"$f":"'Electricity-Calcs'!F28","v":0},{"$f":"'Employee Commute'!C71","v":0},{"$f":"Water!F61","v":0},{"$f":"'Agriculture & Land Management'!F44","v":0},{"$f":"-'Urban Forestry'!D45","v":0},{"$f":"'Waste Production'!D25","v":0},{"$f":"SUMIF('Additional Emission Sources'!$C$16:$C$25, 'Summary-Emissions'!B137, 'Additional Emission Sources'!$K$16:$K$25)","v":0},0,0]
[null,{"$f":"'Background Controls'!I14","v":0},{"$f":"'Stationary-Calcs'!F32","v":0},{"$f":"'Mobile-Summary'!F16","v":0},null,null,{"$f":"'Electricity-Calcs'!F29","v":0},{"$f":"'Employee Commute'!C72","v":0},{"$f":"Water!F62","v":0},{"$f":"'Agriculture & Land Management'!F45","v":0},{"$f":"-'Urban Forestry'!D46","v":0},{"$f":"'Waste Production'!D26","v":0},{"$f":"SUMIF('Additional Emission Sources'!$C$16:$C$25, 'Summary-Emissions'!B138, 'Additional Emission Sources'!$K$16:$K$25)","v":0},0,0]
[null,{"$f":"'Background Controls'!I15","v":0},{"$f":"'Stationary-Calcs'!F33","v":0},{"$f":"'Mobile-Summary'!F17","v":0},null,null,{"$f":"'Electricity-Calcs'!F30","v":0},{"$f":"'Employee Commute'!C73","v":0},{"$f":"Water!F63","v":0},{"$f":"'Agriculture & Land Management'!F46","v":0},{"$f":"-'Urban Forestry'!D47","v":0},{"$f":"'Waste Production'!D27","v":0},{"$f":"SUMIF('Additional Emission Sources'!$C$16:$C$25, 'Summary-Emissions'!B139, 'Additional Emission Sources'!$K$16:$K$25)","v":0},0,0]
[null,{"$f":"'Background Controls'!I16","v":0},{"$f":"'Stationary-Calcs'!F34","v":0},{"$f":"'Mobile-Summary'!F18","v":0},null,null,{"$f":"'Electricity-Calcs'!F31","v":0},{"$f":"'Employee Commute'!C74","v":0},{"$f":"Water!F64","v":0},{"$f":"'Agriculture & Land Management'!F47","v":0},{"$f":"-'Urban Forestry'!D48","v":0},{"$f":"'Waste Production'!D28","v":0},{"$f":"SUMIF('Additional Emission Sources'!$C$16:$C$25, 'Summary-Emissions'!B140, 'Additional Emission Sources'!$K$16:$K$25)","v":0},0,0]
[null,{"$f":"'Background Controls'!I17","v":0},{"$f":"'Stationary-Calcs'!F35","v":0},{"$f":"'Mobile-Summary'!F19","v":0},null,null,{"$f":"'Electricity-Calcs'!F32","v":0},{"$f":"'Employee Commute'!C75","v":0},{"$f":"Water!F65","v":0},{"$f":"'Agriculture & Land Management'!F48","v":0},{"$f":"-'Urban Forestry'!D49","v":0},{"$f":"'Waste Production'!D29","v":0},{"$f":"SUMIF('Additional Emission Sources'!$C$16:$C$25, 'Summary-Emissions'!B141, 'Additional Emission Sources'!$K$16:$K$25)","v":0},0,0]
[null,{"$f":"'Background Controls'!I18","v":0},{"$f":"'Stationary-Calcs'!F36","v":0},{"$f":"'Mobile-Summary'!F20","v":0},null,null,{"$f":"'Electricity-Calcs'!F33","v":0},{"$f":"'Employee Commute'!C76","v":0},{"$f":"Water!F66","v":0},{"$f":"'Agriculture & Land Management'!F49","v":0},{"$f":"-'Urban Forestry'!D50","v":0},{"$f":"'Waste Production'!D30","v":0},{"$f":"SUMIF('Additional Emission Sources'!$C$16:$C$25, 'Summary-Emissions'!B142, 'Additional Emission Sources'!$K$16:$K$25)","v":0},0,0]
[null,{"$f":"'Background Controls'!I19","v":0},{"$f":"'Stationary-Calcs'!F37","v":0},{"$f":"'Mobile-Summary'!F21","v":0},null,null,{"$f":"'Electricity-Calcs'!F34","v":0},{"$f":"'Employee Commute'!C77","v":0},{"$f":"Water!F67","v":0},{"$f":"'Agriculture & Land Management'!F50","v":0},{"$f":"-'Urban Forestry'!D51","v":0},{"$f":"'Waste Production'!D31","v":0},{"$f":"SUMIF('Additional Emission Sources'!$C$16:$C$25, 'Summary-Emissions'!B143, 'Additional Emission Sources'!$K$16:$K$25)","v":0},0,0]
[null,{"$f":"'Background Controls'!I20","v":0},{"$f":"'Stationary-Calcs'!F38","v":0},{"$f":"'Mobile-Summary'!F22","v":0},null,null,{"$f":"'Electricity-Calcs'!F35","v":0},{"$f":"'Employee Commute'!C78","v":0},{"$f":"Water!F68","v":0},{"$f":"'Agriculture & Land Management'!F51","v":0},{"$f":"-'Urban Forestry'!D52","v":0},{"$f":"'Waste Production'!D32","v":0},{"$f":"SUMIF('Additional Emission Sources'!$C$16:$C$25, 'Summary-Emissions'!B144, 'Additional Emission Sources'!$K$16:$K$25)","v":0},0,0]
[null,{"$f":"'Background Controls'!I21","v":0},{"$f":"'Stationary-Calcs'!F39","v":0},{"$f":"'Mobile-Summary'!F23","v":0},null,null,{"$f":"'Electricity-Calcs'!F36","v":0},{"$f":"'Employee Commute'!C79","v":0},{"$f":"Water!F69","v":0},{"$f":"'Agriculture & Land Management'!F52","v":0},{"$f":"-'Urban Forestry'!D53","v":0},{"$f":"'Waste Production'!D33","v":0},{"$f":"SUMIF('Additional Emission Sources'!$C$16:$C$25, 'Summary-Emissions'!B145, 'Additional Emission Sources'!$K$16:$K$25)","v":0},0,0]
[null,{"$f":"'Background Controls'!I22","v":0},{"$f":"'Stationary-Calcs'!F40","v":0},{"$f":"'Mobile-Summary'!F24","v":0},null,null,{"$f":"'Electricity-Calcs'!F37","v":0},{"$f":"'Employee Commute'!C80","v":0},{"$f":"Water!F70","v":0},{"$f":"'Agriculture & Land Management'!F53","v":0},{"$f":"-'Urban Forestry'!D54","v":0},{"$f":"'Waste Production'!D34","v":0},{"$f":"SUMIF('Additional Emission Sources'!$C$16:$C$25, 'Summary-Emissions'!B146, 'Additional Emission Sources'!$K$16:$K$25)","v":0},0,0]
[null,{"$f":"'Background Controls'!I23","v":0},{"$f":"'Stationary-Calcs'!F41","v":0},{"$f":"'Mobile-Summary'!F25","v":0},null,null,{"$f":"'Electricity-Calcs'!F38","v":0},{"$f":"'Employee Commute'!C81","v":0},{"$f":"Water!F71","v":0},{"$f":"'Agriculture & Land Management'!F54","v":0},{"$f":"-'Urban Forestry'!D55","v":0},{"$f":"'Waste Production'!D35","v":0},{"$f":"SUMIF('Additional Emission Sources'!$C$16:$C$25, 'Summary-Emissions'!B147, 'Additional Emission Sources'!$K$16:$K$25)","v":0},0,0]
[null,{"$f":"'Background Controls'!I24","v":0},{"$f":"'Stationary-Calcs'!F42","v":0},{"$f":"'Mobile-Summary'!F26","v":0},null,null,{"$f":"'Electricity-Calcs'!F39","v":0},{"$f":"'Employee Commute'!C82","v":0},{"$f":"Water!F72","v":0},{"$f":"'Agriculture & Land Management'!F55","v":0},{"$f":"-'Urban Forestry'!D56","v":0},{"$f":"'Waste Production'!D36","v":0},{"$f":"SUMIF('Additional Emission Sources'!$C$16:$C$25, 'Summary-Emissions'!B148, 'Additional Emission Sources'!$K$16:$K$25)","v":0},0,0]
["SW",{"$f":"sw_department","v":0},null,null,{"$f":"'Solid Waste-Entry'!$C$80","v":0},null,null,null,null,null,null,null,null,{"$f":"SUM(C149:M149)","v":0}]
["WW",{"$f":"wwt_department","v":0},null,null,null,{"$f":"'Wastewater- Calcs'!D17","v":0},null,null,null,null,null,null,null,0]
[null,null,null,null,null,null,null,null,null,null,{"$f":"SUM(N129:N150)","v":0}]

{"sheet":"Factors","index":31,"n_rows":332,"n_cols":29,"rows_kept":332,"cut":false,"hidden":false,"merged":[[315,0,315,15],[40,6,40,7],[274,0,274,13],[147,0,147,15],[299,0,299,1],[41,6,41,7],[42,6,42,7],[50,6,50,7],[51,6,51,7],[285,6,285,8],[286,6,286,8],[287,6,287,8],[288,6,288,8],[289,6,289,8],[290,6,290,8]]}
["Factors"]
[]
["Unit Conversion Factors"]
[null,null,"Multiply by"]
[null,"kWh to MWh",{"$f":"1/1000","v":1E-3},null,null,null,"Legend:"]
[null,"lbs to metric tons",4.5359236999999999E-4,null,null,null,"Hard-wired factor"]
[null,"kg to metric tons",{"$f":"0.001","v":1E-3},null,null,null,"Calculated factor"]
[null,"g to kg",1E-3]
[null,"lbs to MMT",{"$f":"C6*10^-6","v":4.5359236999999999E-10}]
[null,"scf to mcf",{"$f":"1/1000","v":1E-3}]
[null,"mcf_scf",1000]
[null,"ft3 to m3",2.8316846600000001E-2]
[null,"Per Day to Per Year",365.25]
[null,"grams to  MT",{"$f":"10^-6","v":9.9999999999999995E-7}]
[null,"lbs to kg",0.45359237000000002]
[null,"per Gallon to per MG",{"$f":"10^-6","v":9.9999999999999995E-7}]
[null,"ft3 CH4 to MT CH4",{"$f":"20/10^6","v":2.0000000000000002E-5}]
[null,"mt/short ton",0.90718474000000204]
[null,"CO2 to CO2e",{"$f":"1","v":1}]
[null,"CH4 to CO2e",21]
[null,"N2O to CO2e",310]
[]
["Stationary Fuel Factors"]
["Fuel Emission Factors"]
[null,null,"kg CO2","kg CH4","kg N2O"]
[null,"Fuel","CO2","CH4","N2O","Heat Content (MMBtu/unit)","Unit"]
[null,"Natural Gas",{"$f":"C42*$F27","v":54.504560000000005},5.1400000000000005E-3,1.0280000000000001E-4,{"$f":"F42*1000","v":1.028},"mcf"]
[null,"Digester Gas",43.790869999999998,2.6911999999999999E-3,5.2983000000000001E-4,{"$f":"F43*1000","v":0.84099999999999997},"mcf"]
[null,"Diesel",10.210000000000001,1.5E-3,1E-4,0.13800000000000001,"gal"]
[null,"LPG",5.79,1E-3,1E-4,9.1999999999999998E-2,"gal"]
[null,"Gasoline",8.7799999999999994,1.4E-3,1E-4,0.125,"gal"]
[null,"Residual Fuel Oil No. 5",10.210000000000001,1.5E-3,1E-4,0.14000000000000001,"gal"]
[null,"Residual Fuel Oil No. 6",11.27,1.6999999999999999E-3,1E-4,0.15,"gal"]
[null,"Propane",5.59,1E-3,1E-4,9.0999999999999998E-2,"gal"]
[null,"Butane",6.58,1.1000000000000001E-3,1E-4,0.10100000000000001,"gal"]
[null,"Jet Fuel",{"$f":"C51*$F36","v":9.7497000000000007},{"$f":"D51*$F36","v":1.485E-3},8.1000000000000004E-5,0.13500000000000001,"gal"]
[null,"Bituminous Coal",{"$f":"C52*$F37","v":2328.462},{"$f":"D52*$F37","v":0.27422999999999997},3.9888E-2,24.93,"short tons"]
[]
["Emission Factors Per MMBtu (multiplied by heat content to determine emissions/unit)"]
[null,null,"kg/MMBtu"]
[null,"Fuel","CO2","CH4","N2O","MMBtu/Unit"]
[null,"Natural Gas",53.02,5.0000000000000001E-3,1E-4,{"$f":"1028*10^-6","v":1.0280000000000001E-3},"MMBtu/scf"]
[null,"Digester Gas",52.07,3.2000000000000002E-3,6.3000000000000003E-4,8.4099999999999995E-4,"MMBtu/scf"]
[null,"Diesel",73.959999999999994,null,null,0.13800000000000001,"MMBtu/gal"]
[null,"LPG",62.98,null,null,9.1999999999999998E-2,"MMBtu/gal"]
[null,"Gasoline",70.22,null,null,0.125,"MMBtu/gal"]
[null,"Residual Fuel Oil No. 5",72.930000000000007,null,null,0.14000000000000001,"MMBtu/gal"]
[null,"Residual Fuel Oil No. 6",75.099999999999994,null,null,0.15,"MMBtu/gal"]
[null,"Propane",61.46,null,null,9.0999999999999998E-2,"MMBtu/gal"]
[null,"Butane",65.150000000000006,null,null,0.10100000000000001,"MMBtu/gal"]
[null,"Jet Fuel",72.22,1.0999999999999999E-2,5.9999999999999995E-4,0.13500000000000001,"MMBtu/gal"]
[null,"Bituminous Coal",93.4,1.0999999999999999E-2,1.6000000000000001E-3,24.93,"MMBtu/short ton"]
[]
["Source: CARB (California Air Resources Board). 2010. Local Government Operations Protocol, Version 1.1. California Air Resources Board, California Climate Action Registry, ICLEI, and The Climate Registry."]
[]
["Electricity Factors"]
[]
["eGRID Electricity Emission Factors by eGRID Subregion - Most recent available factor is applied to all future years."]
[null,null,"lbs CO2/MWh"]
[null,"Subregion Name",2000,2001,2002,2003,2004,2005,2006,2007,2008,2009,2010,2011,2012,2013,2014,2015,2016,2017,2018,2019,2020]
["AKGD eGRID subregion","ASCC Alaska Grid",{"$f":"D61","v":1257.19},{"$f":"E61","v":1257.19},{"$f":"F61","v":1257.19},{"$f":"G61","v":1257.19},1257.19,1232.3599999999999,{"$f":"(H61+J61)/2","v":1258.54},1284.72,{"$f":"(J61+L61)/2","v":1282.7891},1280.8581999999999,1256.8658,{"$f":"(M61+O61)/2","v":1262.7985973501968},1268.7313947003938,{"$f":"O61","v":1268.7313947003938},1268.7313947003938,1268.7313947003938,1268.7313947003938,1268.7313947003938,1268.7313947003938,1268.7313947003938,1268.7313947003938]
["AKMS eGRID subregion","ASCC Miscellaneous",{"$f":"D62","v":480.1},480.1,480.1,{"$f":"G62","v":480.1},480.1,498.86,{"$f":"(H62+J62)/2","v":517.29500000000007},535.73,{"$f":"(J62+L62)/2","v":528.49594999999999},521.26189999999997,448.56979999999999,{"$f":"(M62+O62)/2","v":464.86939710695594},481.1689942139119,{"$f":"O62","v":481.1689942139119},481.1689942139119,481.1689942139119,481.1689942139119,481.1689942139119,481.1689942139119,481.1689942139119,481.1689942139119]
["AZNM eGRID subregion","WECC Southwest",{"$f":"D63","v":1254.02},1254.02,1254.02,1254.02,1254.02,1311.05,1281.83,1252.6099999999999,1221.9801499999999,1191.3503000000001,1177.6143,1165.2511044020443,1152.8879088040887,{"$f":"O63","v":1152.8879088040887},1152.8879088040887,1152.8879088040887,1152.8879088040887,1152.8879088040887,1152.8879088040887,1152.8879088040887,1152.8879088040887]
["CAMX eGRID subregion","WECC California",{"$f":"D64","v":878.71},878.71,878.71,878.71,878.71,724.12,702.56500000000005,681.01,669.84730000000002,658.68460000000005,610.81780000000003,630.56496823257794,650.31213646515573,{"$f":"O64","v":650.31213646515573},650.31213646515573,650.31213646515573,650.31213646515573,650.31213646515573,650.31213646515573,650.31213646515573,650.31213646515573]
["ERCT eGRID subregion","ERCOT All",{"$f":"D65","v":1420.56},1420.56,1420.56,1420.56,1420.56,1324.35,1288.46,1252.57,1217.1486500000001,1181.7273,1218.1672000000001,1180.6022506857801,1143.03730137156,{"$f":"O65","v":1143.03730137156},1143.03730137156,1143.03730137156,1143.03730137156,1143.03730137156,1143.03730137156,1143.03730137156,1143.03730137156]
["FRCC eGRID subregion","FRCC All",{"$f":"D66","v":1327.66},1327.66,1327.66,1327.66,1327.66,1318.57,1269.3399999999999,1220.1099999999999,1198.35825,1176.6065000000001,1196.7146,1161.0319819151573,1125.3493638303146,{"$f":"O66","v":1125.3493638303146},1125.3493638303146,1125.3493638303146,1125.3493638303146,1125.3493638303146,1125.3493638303146,1125.3493638303146,1125.3493638303146]
["HIMS eGRID subregion","HICC Miscellaneous",{"$f":"D67","v":1456.17},1456.17,1456.17,1456.17,1456.17,1514.92,1429.37,1343.82,1347.74125,1351.6624999999999,1330.1641,1265.1317411465557,1200.0993822931116,{"$f":"O67","v":1200.0993822931116},1200.0993822931116,1200.0993822931116,1200.0993822931116,1200.0993822931116,1200.0993822931116,1200.0993822931116,1200.0993822931116]
["HIOA eGRID subregion","HICC Oahu",{"$f":"D68","v":1728.12},1728.12,1728.12,1728.12,1728.12,1811.98,1716.37,1620.76,1607.0541499999999,1593.3483000000001,1621.8643,1599.119914154629,1576.3755283092582,{"$f":"O68","v":1576.3755283092582},1576.3755283092582,1576.3755283092582,1576.3755283092582,1576.3755283092582,1576.3755283092582,1576.3755283092582,1576.3755283092582]
["MROE eGRID subregion","MRO East",{"$f":"D69","v":1858.72},1858.72,1858.72,1858.72,1858.72,1834.72,1763.52,1692.32,1641.9859000000001,1591.6518000000001,1610.8030000000001,1566.6866712512328,1522.5703425024653,{"$f":"O69","v":1522.5703425024653},1522.5703425024653,1522.5703425024653,1522.5703425024653,1522.5703425024653,1522.5703425024653,1522.5703425024653,1522.5703425024653]
["MROW eGRID subregion","MRO West",{"$f":"D70","v":1813.81},1813.81,1813.81,1813.81,1813.81,1821.84,1772.2550000000001,1722.67,1675.6366,1628.6032,1536.3605,1480.7552585302801,1425.15001706056,{"$f":"O70","v":1425.15001706056},1425.15001706056,1425.15001706056,1425.15001706056,1425.15001706056,1425.15001706056,1425.15001706056,1425.15001706056]
["NEWE eGRID subregion","NPCC New England",{"$f":"D71","v":908.9},908.9,908.9,908.9,908.9,927.68,877.81500000000005,827.95,778.17935,728.40869999999995,722.07349999999997,679.98686243934571,637.90022487869146,{"$f":"O71","v":637.90022487869146},637.90022487869146,637.90022487869146,637.90022487869146,637.90022487869146,637.90022487869146,637.90022487869146,637.90022487869146]
["NWPP eGRID subregion","WECC Northwest",{"$f":"D72","v":921.1},921.1,921.1,921.1,921.1,902.24,880.51499999999999,858.79,838.99894999999992,819.2079,842.57929999999999,754.16682448841198,665.75434897682396,{"$f":"O72","v":665.75434897682396},665.75434897682396,665.75434897682396,665.75434897682396,665.75434897682396,665.75434897682396,665.75434897682396,665.75434897682396]
["NYCW eGRID subregion","NPCC NYC/Westchester",{"$f":"D73","v":922.22},922.22,922.22,922.22,922.22,815.45,760.125,704.8,657.73434999999995,610.66869999999994,622.41610000000003,659.55667509212265,696.69725018424526,{"$f":"O73","v":696.69725018424526},696.69725018424526,696.69725018424526,696.69725018424526,696.69725018424526,696.69725018424526,696.69725018424526,696.69725018424526]
["NYLI eGRID subregion","NPCC Long Island",{"$f":"D74","v":1412.2},1412.2,1412.2,1412.2,1412.2,1536.8,1477.77,1418.74,1383.3641,1347.9882,1336.1102000000001,1268.6533074301778,1201.1964148603556,{"$f":"O74","v":1201.1964148603556},1201.1964148603556,1201.1964148603556,1201.1964148603556,1201.1964148603556,1201.1964148603556,1201.1964148603556,1201.1964148603556]
["NYUP eGRID subregion","NPCC Upstate NY",{"$f":"D75","v":819.68},819.68,819.68,819.68,819.68,720.8,702.03499999999997,683.27,590.59424999999999,497.91849999999999,545.78689999999995,477.29285147496046,408.79880294992103,{"$f":"O75","v":408.79880294992103},408.79880294992103,408.79880294992103,408.79880294992103,408.79880294992103,408.79880294992103,408.79880294992103,408.79880294992103]
["RFCE eGRID subregion","RFC East",{"$f":"D76","v":1095.53},1095.53,1095.53,1095.53,1095.53,1139.07,1099.1949999999999,1059.32,1003.37185,947.42370000000005,1001.7161,930.13805230734692,858.56000461469387,{"$f":"O76","v":858.56000461469387},858.56000461469387,858.56000461469387,858.56000461469387,858.56000461469387,858.56000461469387,858.56000461469387,858.56000461469387]
["RFCM eGRID subregion","RFC Michigan",{"$f":"D77","v":1641.41},1641.41,1641.41,1641.41,1641.41,1563.28,1607.1949999999999,1651.11,1655.2833999999998,1659.4567999999999,1629.3819000000001,1599.3058123455107,1569.2297246910216,{"$f":"O77","v":1569.2297246910216},1569.2297246910216,1569.2297246910216,1569.2297246910216,1569.2297246910216,1569.2297246910216,1569.2297246910216,1569.2297246910216]
["RFCW eGRID subregion","RFC West",{"$f":"D78","v":1556.39},1556.39,1556.39,1556.39,1556.39,1537.82,1544.67,1551.52,1536.05655,1520.5931,1503.4707000000001,1441.4737681783181,1379.4768363566359,{"$f":"O78","v":1379.4768363566359},1379.4768363566359,1379.4768363566359,1379.4768363566359,1379.4768363566359,1379.4768363566359,1379.4768363566359,1379.4768363566359]
["RMPA eGRID subregion","WECC Rockies",{"$f":"D79","v":2035.81},2035.81,2035.81,2035.81,2035.81,1883.08,1894.57,1906.06,1865.2862500000001,1824.5125,1896.7397000000001,1859.6950580648574,1822.6504161297148,{"$f":"O79","v":1822.6504161297148},1822.6504161297148,1822.6504161297148,1822.6504161297148,1822.6504161297148,1822.6504161297148,1822.6504161297148,1822.6504161297148]
["SPNO eGRID subregion","SPP North",{"$f":"D80","v":1971.42},1971.42,1971.42,1971.42,1971.42,1960.94,1879.825,1798.71,1807.2336500000001,1815.7573,1799.4482,1760.5503731431795,1721.652546286359,{"$f":"O80","v":1721.652546286359},1721.652546286359,1721.652546286359,1721.652546286359,1721.652546286359,1721.652546286359,1721.652546286359,1721.652546286359]
["SPSO eGRID subregion","SPP South",{"$f":"D81","v":1761.14},1761.14,1761.14,1761.14,1761.14,1658.14,1641.085,1624.03,1611.5234,1599.0168000000001,1580.6031,1559.61484810823,1538.6265962164603,{"$f":"O81","v":1538.6265962164603},1538.6265962164603,1538.6265962164603,1538.6265962164603,1538.6265962164603,1538.6265962164603,1538.6265962164603,1538.6265962164603]
["SRMV eGRID subregion","SERC Mississippi Valley",{"$f":"D82","v":1135.46},1135.46,1135.46,1135.46,1135.46,1019.74,1011.9200000000001,1004.1,1003.25595,1002.4118999999999,1029.8161,1041.3671720468471,1052.9182440936943,{"$f":"O82","v":1052.9182440936943},1052.9182440936943,1052.9182440936943,1052.9182440936943,1052.9182440936943,1052.9182440936943,1052.9182440936943,1052.9182440936943]
["SRMW eGRID subregion","SERC Midwest",{"$f":"D83","v":1844.34},1844.34,1844.34,1844.34,1844.34,1830.51,1804.8899999999999,1779.27,1764.5115000000001,1749.7529999999999,1810.8269,1760.7870933362333,1710.7472866724663,{"$f":"O83","v":1710.7472866724663},1710.7472866724663,1710.7472866724663,1710.7472866724663,1710.7472866724663,1710.7472866724663,1710.7472866724663,1710.7472866724663]
["SRSO eGRID subregion","SERC South",{"$f":"D84","v":1490.37},1490.37,1490.37,1490.37,1490.37,1489.54,1492.5050000000001,1495.47,1410.5771,1325.6841999999999,1354.0945999999999,1251.5710738009457,1149.0475476018912,{"$f":"O84","v":1149.0475476018912},1149.0475476018912,1149.0475476018912,1149.0475476018912,1149.0475476018912,1149.0475476018912,1149.0475476018912,1149.0475476018912]
["SRTV eGRID subregion","SERC Tennessee Valley",{"$f":"D85","v":1494.89},1494.89,1494.89,1494.89,1494.89,1510.44,1525.645,1540.85,1449.28035,1357.7107000000001,1389.2003,1363.175428193726,1337.1505563874521,{"$f":"O85","v":1337.1505563874521},1337.1505563874521,1337.1505563874521,1337.1505563874521,1337.1505563874521,1337.1505563874521,1337.1505563874521,1337.1505563874521]
["SRVC eGRID subregion","SERC Virginia/Carolina",{"$f":"D86","v":1146.3900000000001},1146.3900000000001,1146.3900000000001,1146.3900000000001,1146.3900000000001,1134.8800000000001,1126.645,1118.4100000000001,1077.1393,1035.8686,1073.6477,1003.2611289107363,932.87455782147242,{"$f":"O86","v":932.87455782147242},932.87455782147242,932.87455782147242,932.87455782147242,932.87455782147242,932.87455782147242,932.87455782147242,932.87455782147242]
[]
[null,null,"lbs CH4/MWh",null,null,null,null,null,null,null,null,null,null,null,null,null,null,null,null,null,null,null,null,null,"lbs CH4/GWh"]
["eGRID Subregion","Subregion Name",2000,2001,2002,2003,2004,2005,2006,2007,2008,2009,2010,2011,2012,2013,2014,2015,2016,2017,2018,2019,2020,null,2005,2007,2009,2010,2012]
["AKGD eGRID subregion","ASCC Alaska Grid",{"$f":"D90","v":2.6599999999999999E-2},2.6599999999999999E-2,2.6599999999999999E-2,{"$f":"G90","v":2.6599999999999999E-2},2.6599999999999999E-2,{"$f":"Y90/1000","v":2.5600000000000001E-2},{"$f":"(H90+J90)/2","v":2.6355E-2},{"$f":"Z90/1000","v":2.7109999999999999E-2},{"$f":"(J90+L90)/2","v":2.7423499999999996E-2},{"$f":"AA90/1000","v":2.7736999999999998E-2},{"$f":"AB90/1000","v":2.6075600000000001E-2},{"$f":"(M90+O90)/2","v":2.6205402220091798E-2},{"$f":"AC90/1000","v":2.6335204440183595E-2},{"$f":"O90","v":2.6335204440183595E-2},2.6335204440183595E-2,2.6335204440183595E-2,2.6335204440183595E-2,2.6335204440183595E-2,2.6335204440183595E-2,2.6335204440183595E-2,2.6335204440183595E-2,null,25.6,27.11,27.736999999999998,26.075600000000001,26.335204440183595]
["AKMS eGRID subregion","ASCC Miscellaneous",{"$f":"D91","v":2.3900000000000001E-2},2.3900000000000001E-2,2.3900000000000001E-2,2.3900000000000001E-2,2.3900000000000001E-2,2.0750000000000001E-2,{"$f":"(H91+J91)/2","v":2.1700000000000001E-2},2.265E-2,{"$f":"(J91+L91)/2","v":2.22159E-2},2.17818E-2,{"$f":"AB91/1000","v":1.8744900000000002E-2},{"$f":"(M91+O91)/2","v":1.869881038362186E-2},{"$f":"AC91/1000","v":1.8652720767243714E-2},{"$f":"O91","v":1.8652720767243714E-2},1.8652720767243714E-2,1.8652720767243714E-2,1.8652720767243714E-2,1.8652720767243714E-2,1.8652720767243714E-2,1.8652720767243714E-2,1.8652720767243714E-2,null,20.75,22.65,21.7818,18.744900000000001,18.652720767243714]
["AZNM eGRID subregion","WECC Southwest",{"$f":"D92","v":1.7999999999999999E-2},1.7999999999999999E-2,1.7999999999999999E-2,1.7999999999999999E-2,1.7999999999999999E-2,1.745E-2,1.8125000000000002E-2,1.8800000000000001E-2,1.8965849999999999E-2,1.9131699999999998E-2,1.92067E-2,1.8929811476859085E-2,1.8652922953718173E-2,{"$f":"O92","v":1.8652922953718173E-2},1.8652922953718173E-2,1.8652922953718173E-2,1.8652922953718173E-2,1.8652922953718173E-2,1.8652922953718173E-2,1.8652922953718173E-2,1.8652922953718173E-2,null,17.45,18.8,19.131699999999999,19.206700000000001,18.652922953718171]
["CAMX eGRID subregion","WECC California",{"$f":"D93","v":3.024E-2},3.024E-2,3.024E-2,3.024E-2,{"$f":"H93","v":3.024E-2},3.024E-2,2.9264999999999999E-2,2.8289999999999999E-2,2.86152E-2,2.8940400000000002E-2,2.8490100000000001E-2,2.9803139523900589E-2,3.1116179047801177E-2,{"$f":"O93","v":3.1116179047801177E-2},3.1116179047801177E-2,3.1116179047801177E-2,3.1116179047801177E-2,3.1116179047801177E-2,3.1116179047801177E-2,3.1116179047801177E-2,3.1116179047801177E-2,null,30.24,28.29,28.9404,28.490100000000002,31.116179047801175]
["ERCT eGRID subregion","ERCOT All",{"$f":"D94","v":2.1000000000000001E-2},2.1000000000000001E-2,2.1000000000000001E-2,2.1000000000000001E-2,2.1000000000000001E-2,1.865E-2,1.8204999999999999E-2,1.7760000000000001E-2,1.72315E-2,1.6702999999999999E-2,1.68512E-2,1.6775951814245776E-2,1.6700703628491551E-2,{"$f":"O94","v":1.6700703628491551E-2},1.6700703628491551E-2,1.6700703628491551E-2,1.6700703628491551E-2,1.6700703628491551E-2,1.6700703628491551E-2,1.6700703628491551E-2,1.6700703628491551E-2,null,18.649999999999999,17.760000000000002,16.702999999999999,16.851199999999999,16.700703628491553]
["FRCC eGRID subregion","FRCC All",{"$f":"D95","v":5.3999999999999999E-2},5.3999999999999999E-2,5.3999999999999999E-2,5.3999999999999999E-2,5.3999999999999999E-2,4.5920000000000002E-2,4.3554999999999996E-2,4.1189999999999997E-2,4.0214E-2,3.9238000000000002E-2,3.8909899999999997E-2,3.947759030070494E-2,4.004528060140989E-2,{"$f":"O95","v":4.004528060140989E-2},4.004528060140989E-2,4.004528060140989E-2,4.004528060140989E-2,4.004528060140989E-2,4.004528060140989E-2,4.004528060140989E-2,4.004528060140989E-2,null,45.92,41.19,39.238,38.9099,40.045280601409893]
["HIMS eGRID subregion","HICC Miscellaneous",{"$f":"D96","v":0.10100000000000001},0.10100000000000001,0.10100000000000001,0.10100000000000001,0.10100000000000001,0.31468000000000002,0.224915,0.13514999999999999,0.1037743,7.2398600000000007E-2,7.3984800000000003E-2,7.1029911838664861E-2,6.8075023677329705E-2,{"$f":"O96","v":6.8075023677329705E-2},6.8075023677329705E-2,6.8075023677329705E-2,6.8075023677329705E-2,6.8075023677329705E-2,6.8075023677329705E-2,6.8075023677329705E-2,6.8075023677329705E-2,null,314.68,135.15,72.398600000000002,73.984800000000007,68.07502367732971]
["HIOA eGRID subregion","HICC Oahu",{"$f":"D97","v":9.11E-2},9.11E-2,9.11E-2,9.11E-2,9.11E-2,0.10947,0.10025999999999999,9.1049999999999992E-2,9.6397449999999996E-2,0.1017449,9.9298499999999998E-2,9.4852310338906787E-2,9.0406120677813562E-2,{"$f":"O97","v":9.0406120677813562E-2},9.0406120677813562E-2,9.0406120677813562E-2,9.0406120677813562E-2,9.0406120677813562E-2,9.0406120677813562E-2,9.0406120677813562E-2,9.0406120677813562E-2,null,109.47,91.05,101.7449,99.298500000000004,90.406120677813561]
["MROE eGRID subregion","MRO East",{"$f":"D98","v":4.1000000000000002E-2},4.1000000000000002E-2,4.1000000000000002E-2,4.1000000000000002E-2,4.1000000000000002E-2,2.759E-2,2.819E-2,2.879E-2,2.6385449999999998E-2,2.3980899999999999E-2,2.4287599999999999E-2,2.4295486947879204E-2,2.4303373895758408E-2,{"$f":"O98","v":2.4303373895758408E-2},2.4303373895758408E-2,2.4303373895758408E-2,2.4303373895758408E-2,2.4303373895758408E-2,2.4303373895758408E-2,2.4303373895758408E-2,2.4303373895758408E-2,null,27.59,28.79,23.980899999999998,24.287600000000001,24.303373895758408]
["MROW eGRID subregion","MRO West",{"$f":"D99","v":2.8000000000000001E-2},2.8000000000000001E-2,2.8000000000000001E-2,2.8000000000000001E-2,2.8000000000000001E-2,2.8000000000000001E-2,2.8485E-2,2.8969999999999999E-2,2.8884150000000001E-2,2.8798300000000002E-2,2.8527799999999999E-2,2.806189955761185E-2,2.7595999115223702E-2,{"$f":"O99","v":2.7595999115223702E-2},2.7595999115223702E-2,2.7595999115223702E-2,2.7595999115223702E-2,2.7595999115223702E-2,2.7595999115223702E-2,2.7595999115223702E-2,2.7595999115223702E-2,null,28,28.97,28.798300000000001,28.527799999999999,27.595999115223702]
["NEWE eGRID subregion","NPCC New England",{"$f":"D100","v":0.08},0.08,0.08,0.08,0.08,8.6489999999999997E-2,8.1735000000000002E-2,7.6980000000000007E-2,7.6332100000000014E-2,7.5684200000000007E-2,7.1757199999999993E-2,7.2297715307378468E-2,7.2838230614756957E-2,{"$f":"O100","v":7.2838230614756957E-2},7.2838230614756957E-2,7.2838230614756957E-2,7.2838230614756957E-2,7.2838230614756957E-2,7.2838230614756957E-2,7.2838230614756957E-2,7.2838230614756957E-2,null,86.49,76.98,75.684200000000004,71.757199999999997,72.838230614756952]
["NWPP eGRID subregion","WECC Northwest",{"$f":"D101","v":2.1999999999999999E-2},2.1999999999999999E-2,2.1999999999999999E-2,2.1999999999999999E-2,2.1999999999999999E-2,1.9130000000000001E-2,1.7735000000000001E-2,1.634E-2,1.5816549999999999E-2,1.52931E-2,1.6050100000000001E-2,1.4323734863836354E-2,1.2597369727672707E-2,{"$f":"O101","v":1.2597369727672707E-2},1.2597369727672707E-2,1.2597369727672707E-2,1.2597369727672707E-2,1.2597369727672707E-2,1.2597369727672707E-2,1.2597369727672707E-2,1.2597369727672707E-2,null,19.130000000000003,16.34,15.293100000000001,16.0501,12.597369727672707]
["NYCW eGRID subregion","NPCC NYC/Westchester",{"$f":"D102","v":3.7999999999999999E-2},3.7999999999999999E-2,3.7999999999999999E-2,3.7999999999999999E-2,3.7999999999999999E-2,3.6020000000000003E-2,3.1120000000000002E-2,2.622E-2,2.4985449999999999E-2,2.3750900000000002E-2,2.3808299999999998E-2,2.4658533498742932E-2,2.5508766997485867E-2,{"$f":"O102","v":2.5508766997485867E-2},2.5508766997485867E-2,2.5508766997485867E-2,2.5508766997485867E-2,2.5508766997485867E-2,2.5508766997485867E-2,2.5508766997485867E-2,2.5508766997485867E-2,null,36.020000000000003,26.22,23.750900000000001,23.808299999999999,25.508766997485868]
["NYLI eGRID subregion","NPCC Long Island",{"$f":"D103","v":0.10199999999999999},0.10199999999999999,0.10199999999999999,0.10199999999999999,0.10199999999999999,0.11541,0.10295499999999999,9.0499999999999997E-2,9.3682299999999996E-2,9.6864599999999995E-2,8.1485799999999997E-2,7.9843692081517259E-2,7.8201584163034535E-2,{"$f":"O103","v":7.8201584163034535E-2},7.8201584163034535E-2,7.8201584163034535E-2,7.8201584163034535E-2,7.8201584163034535E-2,7.8201584163034535E-2,7.8201584163034535E-2,7.8201584163034535E-2,null,115.41,90.5,96.864599999999996,81.485799999999998,78.201584163034539]
["NYUP eGRID subregion","NPCC Upstate NY",{"$f":"D104","v":2.4E-2},2.4E-2,2.4E-2,2.4E-2,2.4E-2,2.4819999999999998E-2,2.1115000000000002E-2,1.7410000000000002E-2,1.667445E-2,1.5938899999999999E-2,1.62974E-2,1.5945712494778413E-2,1.5594024989556825E-2,{"$f":"O104","v":1.5594024989556825E-2},1.5594024989556825E-2,1.5594024989556825E-2,1.5594024989556825E-2,1.5594024989556825E-2,1.5594024989556825E-2,1.5594024989556825E-2,1.5594024989556825E-2,null,24.819999999999997,17.41,15.9389,16.2974,15.594024989556825]
["RFCE eGRID subregion","RFC East",{"$f":"D105","v":2.8000000000000001E-2},2.8000000000000001E-2,2.8000000000000001E-2,2.8000000000000001E-2,2.8000000000000001E-2,3.0269999999999998E-2,2.8835E-2,2.7399999999999997E-2,2.7119049999999999E-2,2.68381E-2,2.7071100000000001E-2,2.6757585583216597E-2,2.6444071166433193E-2,{"$f":"O105","v":2.6444071166433193E-2},2.6444071166433193E-2,2.6444071166433193E-2,2.6444071166433193E-2,2.6444071166433193E-2,2.6444071166433193E-2,2.6444071166433193E-2,2.6444071166433193E-2,null,30.27,27.4,26.838100000000001,27.071100000000001,26.444071166433194]
["RFCM eGRID subregion","RFC Michigan",{"$f":"D106","v":3.5000000000000003E-2},3.5000000000000003E-2,3.5000000000000003E-2,3.5000000000000003E-2,3.5000000000000003E-2,3.3930000000000002E-2,3.3239999999999999E-2,3.2549999999999996E-2,3.1979499999999994E-2,3.1408999999999999E-2,3.04642E-2,3.0412403034485423E-2,3.0360606068970845E-2,{"$f":"O106","v":3.0360606068970845E-2},3.0360606068970845E-2,3.0360606068970845E-2,3.0360606068970845E-2,3.0360606068970845E-2,3.0360606068970845E-2,3.0360606068970845E-2,3.0360606068970845E-2,null,33.93,32.549999999999997,31.408999999999999,30.464200000000002,30.360606068970846]
["RFCW eGRID subregion","RFC West",{"$f":"D107","v":0.02},0.02,0.02,0.02,0.02,1.823E-2,1.83E-2,1.8370000000000001E-2,1.82445E-2,1.8119E-2,1.82042E-2,1.7656518292526555E-2,1.7108836585053109E-2,{"$f":"O107","v":1.7108836585053109E-2},1.7108836585053109E-2,1.7108836585053109E-2,1.7108836585053109E-2,1.7108836585053109E-2,1.7108836585053109E-2,1.7108836585053109E-2,1.7108836585053109E-2,null,18.23,18.37,18.119,18.2042,17.108836585053108]
["RMPA eGRID subregion","WECC Rockies",{"$f":"D108","v":2.4E-2},2.4E-2,2.4E-2,2.4E-2,2.4E-2,2.2880000000000001E-2,2.3254999999999998E-2,2.3629999999999998E-2,2.2939499999999998E-2,2.2248999999999998E-2,2.2659800000000001E-2,2.2158738622164512E-2,2.1657677244329022E-2,{"$f":"O108","v":2.1657677244329022E-2},2.1657677244329022E-2,2.1657677244329022E-2,2.1657677244329022E-2,2.1657677244329022E-2,2.1657677244329022E-2,2.1657677244329022E-2,2.1657677244329022E-2,null,22.880000000000003,23.63,22.248999999999999,22.659800000000001,21.657677244329022]
["SPNO eGRID subregion","SPP North",{"$f":"D109","v":2.4E-2},2.4E-2,2.4E-2,2.4E-2,2.4E-2,2.3820000000000001E-2,2.2519999999999998E-2,2.1219999999999999E-2,2.1114300000000003E-2,2.1008600000000002E-2,2.0807200000000001E-2,2.0511419664915174E-2,2.0215639329830351E-2,{"$f":"O109","v":2.0215639329830351E-2},2.0215639329830351E-2,2.0215639329830351E-2,2.0215639329830351E-2,2.0215639329830351E-2,2.0215639329830351E-2,2.0215639329830351E-2,2.0215639329830351E-2,null,23.82,21.22,21.008600000000001,20.807200000000002,20.215639329830353]
["SPSO eGRID subregion","SPP South",{"$f":"D110","v":0.03},0.03,0.03,0.03,0.03,2.4979999999999999E-2,2.4750000000000001E-2,2.452E-2,2.3884000000000002E-2,2.3248000000000001E-2,2.3199999999999998E-2,2.3475352482567553E-2,2.3750704965135112E-2,{"$f":"O110","v":2.3750704965135112E-2},2.3750704965135112E-2,2.3750704965135112E-2,2.3750704965135112E-2,2.3750704965135112E-2,2.3750704965135112E-2,2.3750704965135112E-2,2.3750704965135112E-2,null,24.98,24.52,23.248000000000001,23.2,23.75070496513511]
["SRMV eGRID subregion","SERC Mississippi Valley",{"$f":"D111","v":4.2000000000000003E-2},4.2000000000000003E-2,4.2000000000000003E-2,4.2000000000000003E-2,4.2000000000000003E-2,2.4309999999999998E-2,2.3054999999999999E-2,2.18E-2,2.0623800000000001E-2,1.9447600000000002E-2,2.0663299999999999E-2,2.0808022604885061E-2,2.095274520977012E-2,{"$f":"O111","v":2.095274520977012E-2},2.095274520977012E-2,2.095274520977012E-2,2.095274520977012E-2,2.095274520977012E-2,2.095274520977012E-2,2.095274520977012E-2,2.095274520977012E-2,null,24.31,21.8,19.447600000000001,20.6633,20.952745209770121]
["SRMW eGRID subregion","SERC Midwest",{"$f":"D112","v":2.1000000000000001E-2},2.1000000000000001E-2,2.1000000000000001E-2,2.1000000000000001E-2,2.1000000000000001E-2,2.1149999999999999E-2,2.086E-2,2.0570000000000001E-2,2.0070450000000004E-2,1.9570900000000002E-2,2.0483499999999998E-2,2.0032935680749209E-2,1.9582371361498423E-2,{"$f":"O112","v":1.9582371361498423E-2},1.9582371361498423E-2,1.9582371361498423E-2,1.9582371361498423E-2,1.9582371361498423E-2,1.9582371361498423E-2,1.9582371361498423E-2,1.9582371361498423E-2,null,21.15,20.57,19.570900000000002,20.483499999999999,19.582371361498424]
["SRSO eGRID subregion","SERC South",{"$f":"D113","v":0.04},0.04,0.04,0.04,0.04,2.6270000000000002E-2,2.4955000000000001E-2,2.3640000000000001E-2,2.295585E-2,2.2271699999999998E-2,2.2821500000000002E-2,2.2741426867134346E-2,2.2661353734268693E-2,{"$f":"O113","v":2.2661353734268693E-2},2.2661353734268693E-2,2.2661353734268693E-2,2.2661353734268693E-2,2.2661353734268693E-2,2.2661353734268693E-2,2.2661353734268693E-2,2.2661353734268693E-2,null,26.270000000000003,23.64,22.271699999999999,22.8215,22.661353734268694]
["SRTV eGRID subregion","SERC Tennessee Valley",{"$f":"D114","v":2.3E-2},2.3E-2,2.3E-2,2.3E-2,2.3E-2,2.0049999999999998E-2,1.9959999999999999E-2,1.9870000000000002E-2,1.85735E-2,1.7277000000000001E-2,1.7696200000000002E-2,1.7540919368329411E-2,1.7385638736658819E-2,{"$f":"O114","v":1.7385638736658819E-2},1.7385638736658819E-2,1.7385638736658819E-2,1.7385638736658819E-2,1.7385638736658819E-2,1.7385638736658819E-2,1.7385638736658819E-2,1.7385638736658819E-2,null,20.049999999999997,19.87,17.277000000000001,17.696200000000001,17.385638736658819]
["SRVC eGRID subregion","SERC Virginia/Carolina",{"$f":"D115","v":2.9000000000000001E-2},2.9000000000000001E-2,2.9000000000000001E-2,2.9000000000000001E-2,2.9000000000000001E-2,2.3769999999999999E-2,2.3015000000000001E-2,2.2260000000000002E-2,2.1885800000000004E-2,2.1511600000000002E-2,2.1691600000000002E-2,2.2819709025933013E-2,2.3947818051866021E-2,{"$f":"O115","v":2.3947818051866021E-2},2.3947818051866021E-2,2.3947818051866021E-2,2.3947818051866021E-2,2.3947818051866021E-2,2.3947818051866021E-2,2.3947818051866021E-2,2.3947818051866021E-2,null,23.77,22.26,21.511600000000001,21.691600000000001,23.947818051866022]
[]
[]
[null,null,"lbs N2O/MWh",null,null,null,null,null,null,null,null,null,null,null,null,null,null,null,null,null,null,null,null,null,"lbs N2O/GWh"]
["eGRID Subregion","Subregion Name",2000,2001,2002,2003,2004,2005,2006,2007,2008,2009,2010,2011,2012,2013,2014,2015,2016,2017,2018,2019,2020,null,2005,2007,2009,2010,2012]
["AKGD eGRID subregion","ASCC Alaska Grid",{"$f":"D120","v":6.4000000000000003E-3},6.4000000000000003E-3,6.4000000000000003E-3,{"$f":"G120","v":6.4000000000000003E-3},6.4000000000000003E-3,{"$f":"Y120/1000","v":6.5100000000000002E-3},{"$f":"(H120+J120)/2","v":6.9750000000000003E-3},{"$f":"Z120/1000","v":7.4400000000000004E-3},{"$f":"(J120+L120)/2","v":7.5638500000000004E-3},{"$f":"AA120/1000","v":7.6877000000000004E-3},{"$f":"AB120/1000","v":7.1792000000000002E-3},{"$f":"(M120+O120)/2","v":7.3869822439804837E-3},{"$f":"AC120/1000","v":7.594764487960968E-3},{"$f":"O120","v":7.594764487960968E-3},7.594764487960968E-3,7.594764487960968E-3,7.594764487960968E-3,7.594764487960968E-3,7.594764487960968E-3,7.594764487960968E-3,7.594764487960968E-3,null,6.51,7.44,7.6877000000000004,7.1791999999999998,7.5947644879609681]
["AKMS eGRID subregion","ASCC Miscellaneous",{"$f":"D121","v":4.4000000000000003E-3},4.4000000000000003E-3,4.4000000000000003E-3,4.4000000000000003E-3,4.4000000000000003E-3,4.0800000000000003E-3,{"$f":"(H121+J121)/2","v":4.2800000000000008E-3},4.4800000000000005E-3,{"$f":"(J121+L121)/2","v":4.3806999999999995E-3},4.2813999999999994E-3,{"$f":"AB121/1000","v":3.6806E-3},{"$f":"(M121+O121)/2","v":3.6144130769321346E-3},{"$f":"AC121/1000","v":3.5482261538642692E-3},{"$f":"O121","v":3.5482261538642692E-3},3.5482261538642692E-3,3.5482261538642692E-3,3.5482261538642692E-3,3.5482261538642692E-3,3.5482261538642692E-3,3.5482261538642692E-3,3.5482261538642692E-3,null,4.08,4.4800000000000004,4.2813999999999997,3.6806000000000001,3.5482261538642694]
["AZNM eGRID subregion","WECC Southwest",{"$f":"D122","v":1.4999999999999999E-2},1.4999999999999999E-2,1.4999999999999999E-2,1.4999999999999999E-2,1.4999999999999999E-2,1.7940000000000001E-2,1.7255E-2,1.6570000000000001E-2,1.6075900000000001E-2,1.55818E-2,1.57231E-2,1.5414622605812261E-2,1.5106145211624523E-2,{"$f":"O122","v":1.5106145211624523E-2},1.5106145211624523E-2,1.5106145211624523E-2,1.5106145211624523E-2,1.5106145211624523E-2,1.5106145211624523E-2,1.5106145211624523E-2,1.5106145211624523E-2,null,17.940000000000001,16.57,15.581799999999999,15.723100000000001,15.106145211624524]
["CAMX eGRID subregion","WECC California",{"$f":"D123","v":8.0800000000000004E-3},8.0800000000000004E-3,8.0800000000000004E-3,8.0800000000000004E-3,{"$f":"H123","v":8.0800000000000004E-3},8.0800000000000004E-3,7.1549999999999999E-3,6.2300000000000003E-3,6.1976500000000007E-3,6.1653000000000003E-3,6.0270999999999996E-3,5.8505476319126934E-3,5.6739952638253863E-3,{"$f":"O123","v":5.6739952638253863E-3},5.6739952638253863E-3,5.6739952638253863E-3,5.6739952638253863E-3,5.6739952638253863E-3,5.6739952638253863E-3,5.6739952638253863E-3,5.6739952638253863E-3,null,8.08,6.23,6.1653000000000002,6.0270999999999999,5.6739952638253861]
["ERCT eGRID subregion","ERCOT All",{"$f":"D124","v":1.4999999999999999E-2},1.4999999999999999E-2,1.4999999999999999E-2,1.4999999999999999E-2,1.4999999999999999E-2,1.511E-2,1.455E-2,1.3990000000000001E-2,1.354675E-2,1.3103500000000001E-2,1.4071E-2,1.3202864722870161E-2,1.2334729445740322E-2,{"$f":"O124","v":1.2334729445740322E-2},1.2334729445740322E-2,1.2334729445740322E-2,1.2334729445740322E-2,1.2334729445740322E-2,1.2334729445740322E-2,1.2334729445740322E-2,1.2334729445740322E-2,null,15.11,13.99,13.1035,14.071,12.334729445740322]
["FRCC eGRID subregion","FRCC All",{"$f":"D125","v":1.6E-2},1.6E-2,1.6E-2,1.6E-2,1.6E-2,1.694E-2,1.6094999999999998E-2,1.525E-2,1.439145E-2,1.35329E-2,1.3746399999999999E-2,1.2799569095500313E-2,1.1852738191000627E-2,{"$f":"O125","v":1.1852738191000627E-2},1.1852738191000627E-2,1.1852738191000627E-2,1.1852738191000627E-2,1.1852738191000627E-2,1.1852738191000627E-2,1.1852738191000627E-2,1.1852738191000627E-2,null,16.940000000000001,15.25,13.5329,13.7464,11.852738191000627]
["HIMS eGRID subregion","HICC Miscellaneous",{"$f":"D126","v":1.7999999999999999E-2},1.7999999999999999E-2,1.7999999999999999E-2,1.7999999999999999E-2,1.7999999999999999E-2,4.6879999999999998E-2,3.4294999999999999E-2,2.171E-2,1.775705E-2,1.38041E-2,1.38818E-2,1.3282558658356177E-2,1.2683317316712354E-2,{"$f":"O126","v":1.2683317316712354E-2},1.2683317316712354E-2,1.2683317316712354E-2,1.2683317316712354E-2,1.2683317316712354E-2,1.2683317316712354E-2,1.2683317316712354E-2,1.2683317316712354E-2,null,46.879999999999995,21.71,13.8041,13.8818,12.683317316712353]
["HIOA eGRID subregion","HICC Oahu",{"$f":"D127","v":2.12E-2},2.12E-2,2.12E-2,2.12E-2,2.12E-2,2.3619999999999999E-2,2.2254999999999997E-2,2.0889999999999999E-2,2.1435249999999999E-2,2.19805E-2,2.2411199999999999E-2,2.1980722652640623E-2,2.1550245305281247E-2,{"$f":"O127","v":2.1550245305281247E-2},2.1550245305281247E-2,2.1550245305281247E-2,2.1550245305281247E-2,2.1550245305281247E-2,2.1550245305281247E-2,2.1550245305281247E-2,2.1550245305281247E-2,null,23.619999999999997,20.89,21.980499999999999,22.411200000000001,21.550245305281248]
["MROE eGRID subregion","MRO East",{"$f":"D128","v":0.03},0.03,0.03,0.03,0.03,3.0360000000000002E-2,2.9705000000000002E-2,2.9049999999999999E-2,2.8045649999999998E-2,2.7041300000000001E-2,2.75216E-2,2.6538148479555185E-2,2.5554696959110369E-2,{"$f":"O128","v":2.5554696959110369E-2},2.5554696959110369E-2,2.5554696959110369E-2,2.5554696959110369E-2,2.5554696959110369E-2,2.5554696959110369E-2,2.5554696959110369E-2,2.5554696959110369E-2,null,30.360000000000003,29.05,27.0413,27.521599999999999,25.55469695911037]
["MROW eGRID subregion","MRO West",{"$f":"D129","v":2.9000000000000001E-2},2.9000000000000001E-2,2.9000000000000001E-2,2.9000000000000001E-2,2.9000000000000001E-2,3.0710000000000001E-2,2.9950000000000001E-2,2.9190000000000001E-2,2.8490099999999997E-2,2.7790199999999998E-2,2.6291100000000001E-2,2.5276079994984622E-2,2.4261059989969243E-2,{"$f":"O129","v":2.4261059989969243E-2},2.4261059989969243E-2,2.4261059989969243E-2,2.4261059989969243E-2,2.4261059989969243E-2,2.4261059989969243E-2,2.4261059989969243E-2,2.4261059989969243E-2,null,30.71,29.19,27.790199999999999,26.2911,24.261059989969244]
["NEWE eGRID subregion","NPCC New England",{"$f":"D130","v":1.4999999999999999E-2},1.4999999999999999E-2,1.4999999999999999E-2,1.4999999999999999E-2,1.4999999999999999E-2,1.7010000000000001E-2,1.6105000000000001E-2,1.52E-2,1.45275E-2,1.3855000000000001E-2,1.2976100000000001E-2,1.1841893503815662E-2,1.0707687007631321E-2,{"$f":"O130","v":1.0707687007631321E-2},1.0707687007631321E-2,1.0707687007631321E-2,1.0707687007631321E-2,1.0707687007631321E-2,1.0707687007631321E-2,1.0707687007631321E-2,1.0707687007631321E-2,null,17.010000000000002,15.2,13.855,12.976100000000001,10.707687007631321]
["NWPP eGRID subregion","WECC Northwest",{"$f":"D131","v":1.4E-2},1.4E-2,1.4E-2,1.4E-2,1.4E-2,1.49E-2,1.4270000000000001E-2,1.3640000000000001E-2,1.3070200000000001E-2,1.25004E-2,1.30724E-2,1.17237088458019E-2,1.0375017691603799E-2,{"$f":"O131","v":1.0375017691603799E-2},1.0375017691603799E-2,1.0375017691603799E-2,1.0375017691603799E-2,1.0375017691603799E-2,1.0375017691603799E-2,1.0375017691603799E-2,1.0375017691603799E-2,null,14.9,13.64,12.500400000000001,13.0724,10.375017691603798]
["NYCW eGRID subregion","NPCC NYC/Westchester",{"$f":"D132","v":6.0000000000000001E-3},6.0000000000000001E-3,6.0000000000000001E-3,6.0000000000000001E-3,6.0000000000000001E-3,5.4599999999999996E-3,4.4050000000000001E-3,3.3500000000000001E-3,3.0782500000000003E-3,2.8065000000000004E-3,2.8003999999999998E-3,2.8663434387654835E-3,2.9322868775309668E-3,{"$f":"O132","v":2.9322868775309668E-3},2.9322868775309668E-3,2.9322868775309668E-3,2.9322868775309668E-3,2.9322868775309668E-3,2.9322868775309668E-3,2.9322868775309668E-3,2.9322868775309668E-3,null,5.46,3.35,2.8065000000000002,2.8003999999999998,2.932286877530967]
["NYLI eGRID subregion","NPCC Long Island",{"$f":"D133","v":1.6E-2},1.6E-2,1.6E-2,1.6E-2,1.6E-2,1.8089999999999998E-2,1.5594999999999998E-2,1.3099999999999999E-2,1.2736649999999999E-2,1.23733E-2,1.0284700000000001E-2,1.007644798520228E-2,9.8681959704045568E-3,{"$f":"O133","v":9.8681959704045568E-3},9.8681959704045568E-3,9.8681959704045568E-3,9.8681959704045568E-3,9.8681959704045568E-3,9.8681959704045568E-3,9.8681959704045568E-3,9.8681959704045568E-3,null,18.09,13.1,12.3733,10.284700000000001,9.8681959704045568]
["NYUP eGRID subregion","NPCC Upstate NY",{"$f":"D134","v":1.0999999999999999E-2},1.0999999999999999E-2,1.0999999999999999E-2,1.0999999999999999E-2,1.0999999999999999E-2,1.119E-2,1.0545000000000001E-2,9.9000000000000008E-3,8.3327499999999999E-3,6.7655000000000007E-3,7.2418999999999999E-3,5.534399130768526E-3,3.8268982615370525E-3,{"$f":"O134","v":3.8268982615370525E-3},3.8268982615370525E-3,3.8268982615370525E-3,3.8268982615370525E-3,3.8268982615370525E-3,3.8268982615370525E-3,3.8268982615370525E-3,3.8268982615370525E-3,null,11.19,9.9,6.7655000000000003,7.2419000000000002,3.8268982615370524]
["RFCE eGRID subregion","RFC East",{"$f":"D135","v":1.7000000000000001E-2},1.7000000000000001E-2,1.7000000000000001E-2,1.7000000000000001E-2,1.7000000000000001E-2,1.8710000000000001E-2,1.787E-2,1.703E-2,1.5996200000000002E-2,1.4962400000000001E-2,1.5329800000000001E-2,1.3408549029163618E-2,1.1487298058327234E-2,{"$f":"O135","v":1.1487298058327234E-2},1.1487298058327234E-2,1.1487298058327234E-2,1.1487298058327234E-2,1.1487298058327234E-2,1.1487298058327234E-2,1.1487298058327234E-2,1.1487298058327234E-2,null,18.71,17.03,14.962400000000001,15.329800000000001,11.487298058327234]
["RFCM eGRID subregion","RFC Michigan",{"$f":"D136","v":2.5000000000000001E-2},2.5000000000000001E-2,2.5000000000000001E-2,2.5000000000000001E-2,2.5000000000000001E-2,2.717E-2,2.7479999999999997E-2,2.7789999999999999E-2,2.7839200000000001E-2,2.7888400000000001E-2,2.6840800000000001E-2,2.5478167700607124E-2,2.4115535401214243E-2,{"$f":"O136","v":2.4115535401214243E-2},2.4115535401214243E-2,2.4115535401214243E-2,2.4115535401214243E-2,2.4115535401214243E-2,2.4115535401214243E-2,2.4115535401214243E-2,2.4115535401214243E-2,null,27.169999999999998,27.79,27.888400000000001,26.840800000000002,24.115535401214242]
["RFCW eGRID subregion","RFC West",{"$f":"D137","v":2.4E-2},2.4E-2,2.4E-2,2.4E-2,2.4E-2,2.571E-2,2.5819999999999999E-2,2.5929999999999998E-2,2.5531699999999997E-2,2.51334E-2,2.4746899999999999E-2,2.3206694340935557E-2,2.1666488681871116E-2,{"$f":"O137","v":2.1666488681871116E-2},2.1666488681871116E-2,2.1666488681871116E-2,2.1666488681871116E-2,2.1666488681871116E-2,2.1666488681871116E-2,2.1666488681871116E-2,2.1666488681871116E-2,null,25.71,25.93,25.133400000000002,24.7469,21.666488681871115]
["RMPA eGRID subregion","WECC Rockies",{"$f":"D138","v":0.03},0.03,0.03,0.03,0.03,2.8750000000000001E-2,2.8819999999999998E-2,2.8889999999999999E-2,2.804015E-2,2.7190300000000001E-2,2.9206600000000003E-2,2.8668048950247764E-2,2.8129497900495522E-2,{"$f":"O138","v":2.8129497900495522E-2},2.8129497900495522E-2,2.8129497900495522E-2,2.8129497900495522E-2,2.8129497900495522E-2,2.8129497900495522E-2,2.8129497900495522E-2,2.8129497900495522E-2,null,28.75,28.89,27.190300000000001,29.206600000000002,28.129497900495522]
["SPNO eGRID subregion","SPP North",{"$f":"D139","v":0.03},0.03,0.03,0.03,0.03,3.209E-2,3.0644999999999999E-2,2.92E-2,2.9045499999999998E-2,2.8890999999999997E-2,2.86235E-2,2.7883756524214581E-2,2.7144013048429162E-2,{"$f":"O139","v":2.7144013048429162E-2},2.7144013048429162E-2,2.7144013048429162E-2,2.7144013048429162E-2,2.7144013048429162E-2,2.7144013048429162E-2,2.7144013048429162E-2,2.7144013048429162E-2,null,32.090000000000003,29.2,28.890999999999998,28.6235,27.144013048429162]
["SPSO eGRID subregion","SPP South",{"$f":"D140","v":2.3E-2},2.3E-2,2.3E-2,2.3E-2,2.3E-2,2.2610000000000002E-2,2.2515E-2,2.2420000000000002E-2,2.2103750000000002E-2,2.1787500000000001E-2,2.0850999999999998E-2,2.0413003435335413E-2,1.9975006870670831E-2,{"$f":"O140","v":1.9975006870670831E-2},1.9975006870670831E-2,1.9975006870670831E-2,1.9975006870670831E-2,1.9975006870670831E-2,1.9975006870670831E-2,1.9975006870670831E-2,1.9975006870670831E-2,null,22.610000000000003,22.42,21.787500000000001,20.850999999999999,19.975006870670832]
["SRMV eGRID subregion","SERC Mississippi Valley",{"$f":"D141","v":1.2999999999999999E-2},1.2999999999999999E-2,1.2999999999999999E-2,1.2999999999999999E-2,1.2999999999999999E-2,1.171E-2,1.1429999999999999E-2,1.115E-2,1.0902200000000001E-2,1.0654400000000001E-2,1.0755800000000001E-2,1.0681444183638693E-2,1.0607088367277383E-2,{"$f":"O141","v":1.0607088367277383E-2},1.0607088367277383E-2,1.0607088367277383E-2,1.0607088367277383E-2,1.0607088367277383E-2,1.0607088367277383E-2,1.0607088367277383E-2,1.0607088367277383E-2,null,11.709999999999999,11.15,10.654400000000001,10.755800000000001,10.607088367277383]
["SRMW eGRID subregion","SERC Midwest",{"$f":"D142","v":2.9000000000000001E-2},2.9000000000000001E-2,2.9000000000000001E-2,2.9000000000000001E-2,2.9000000000000001E-2,3.0499999999999999E-2,3.005E-2,2.9600000000000001E-2,2.9291250000000001E-2,2.8982500000000001E-2,2.9574300000000001E-2,2.8536707230141387E-2,2.7499114460282772E-2,{"$f":"O142","v":2.7499114460282772E-2},2.7499114460282772E-2,2.7499114460282772E-2,2.7499114460282772E-2,2.7499114460282772E-2,2.7499114460282772E-2,2.7499114460282772E-2,2.7499114460282772E-2,null,30.5,29.6,28.982500000000002,29.574300000000001,27.499114460282772]
["SRSO eGRID subregion","SERC South",{"$f":"D143","v":2.5000000000000001E-2},2.5000000000000001E-2,2.5000000000000001E-2,2.5000000000000001E-2,2.5000000000000001E-2,2.547E-2,2.5020000000000001E-2,2.4570000000000002E-2,2.2672750000000002E-2,2.0775500000000002E-2,2.0887899999999997E-2,1.8187855309150097E-2,1.5487810618300199E-2,{"$f":"O143","v":1.5487810618300199E-2},1.5487810618300199E-2,1.5487810618300199E-2,1.5487810618300199E-2,1.5487810618300199E-2,1.5487810618300199E-2,1.5487810618300199E-2,1.5487810618300199E-2,null,25.47,24.57,20.775500000000001,20.887899999999998,15.487810618300198]
["SRTV eGRID subregion","SERC Tennessee Valley",{"$f":"D144","v":2.4E-2},2.4E-2,2.4E-2,2.4E-2,2.4E-2,2.564E-2,2.5559999999999999E-2,2.5479999999999999E-2,2.3783200000000001E-2,2.2086400000000003E-2,2.24122E-2,2.1598133054585439E-2,2.0784066109170881E-2,{"$f":"O144","v":2.0784066109170881E-2},2.0784066109170881E-2,2.0784066109170881E-2,2.0784066109170881E-2,2.0784066109170881E-2,2.0784066109170881E-2,2.0784066109170881E-2,2.0784066109170881E-2,null,25.64,25.48,22.086400000000001,22.412199999999999,20.78406610917088]
["SRVC eGRID subregion","SERC Virginia/Carolina",{"$f":"D145","v":1.9E-2},1.9E-2,1.9E-2,1.9E-2,1.9E-2,1.9789999999999999E-2,1.9435000000000001E-2,1.908E-2,1.8263399999999999E-2,1.7446799999999998E-2,1.7640400000000001E-2,1.6119917559908766E-2,1.4599435119817534E-2,{"$f":"O145","v":1.4599435119817534E-2},1.4599435119817534E-2,1.4599435119817534E-2,1.4599435119817534E-2,1.4599435119817534E-2,1.4599435119817534E-2,1.4599435119817534E-2,1.4599435119817534E-2,null,19.79,19.079999999999998,17.4468,17.6404,14.599435119817533]
[]
["Sources:"]
["Emissions & Generation Resource Integrated Database (eGRID). http://www.epa.gov/cleanenergy/energy-resources/egrid/index.html. "]
["CARB (California Air Resources Board). 2010. Local Government Operations Protocol, Version 1.1. California Air Resources Board, California Climate Action Registry, ICLEI, and The Climate Registry."]
[]
["Mobile Factors"]
[]
["Fuel CO2 Emission Factors"]
[]
[null,"kg CO2/gallon (GGE for CNG)"]
["Other Fuels","Total","Biogenic Portion","Fossil portion","MMBTU/unit"]
["Gasoline",{"$f":"C157+D157","v":8.7799999999999994},null,8.7799999999999994,{"$f":"5.25/42","v":0.125}]
["Diesel",{"$f":"C158+D158","v":10.210000000000001},null,10.210000000000001,{"$f":"5.8/42","v":0.1380952380952381}]
["Biodiesel (B5)",10.172000000000001,{"$f":"0.05*C161","v":0.47249999999999998},{"$f":"0.95*D158","v":9.6995000000000005},{"$f":"0.05*$E$161+0.95*$E$158","v":0.1375952380952381}]
["Biodiesel (B20)",10.058000000000002,{"$f":"0.2*C161","v":1.89},{"$f":"0.8*D158","v":8.168000000000001},{"$f":"0.2*$E$161+0.8*$E$158","v":0.1360952380952381}]
["B100",9.4499999999999993,9.4499999999999993,null,{"$f":"5.38/42","v":0.1280952380952381}]
["Ethanol (E85)",6.2045000000000003,{"$f":"0.85*C163","v":4.8875000000000002},{"$f":"0.15*D157","v":1.3169999999999999},{"$f":"0.85*$E$163+(1-0.85)*$E$157","v":9.0190476190476182E-2}]
["E100",5.75,5.75,null,{"$f":"3.53/42","v":8.4047619047619038E-2}]
["CNG",6.8401800000000001,null,6.8401800000000001,{"$f":"$E$157","v":0.125}]
["LNG",4.46,null,4.46,{"$f":"75000*10^-6","v":7.4999999999999997E-2}]
["LPG",5.79,null,5.79,{"$f":"3.86/42","v":9.1904761904761906E-2}]
["Methanol",4.0999999999999996,null,4.0999999999999996]
["Residual Fuel",11.8,null,11.8,{"$f":"6.29/42","v":0.14976190476190476}]
["Jet Fuel",9.57,null,9.57,{"$f":"5.67/42","v":0.13500000000000001}]
["Aviation Gasoline",8.31,null,8.31,{"$f":"5.04/42","v":0.12}]
[]
["Default CH4 and N2O Emission Factors for Highway Vehicles by Model Year"]
[]
[null,"Vehicle Type and Year","CH4 (g/mi)",null,null,null,null,null,null,"Vehicle Type and Year","N2O (g/mi)"]
[null,null,"Gasoline","Gasoline","Gasoline","Diesel","Diesel","Diesel",null,null,"Gasoline","Gasoline","Gasoline","Diesel","Diesel","Diesel"]
[null,null,"Passenger Car","Light Truck (Vans, Pickup Trucks, SUVs)","Heavy-Duty Vehicle","Passenger Car","Light Truck (Vans, Pickup Trucks, SUVs)","Heavy-Duty Vehicle",null,null,"Passenger Car","Light Truck (Vans, Pickup Trucks, SUVs)","Heavy-Duty Vehicle","Passenger Car","Light Truck (Vans, Pickup Trucks, SUVs)","Heavy-Duty Vehicle"]
[null,null,{"$f":"C175&C176","v":"GasolinePassenger Car"},"GasolineLight Truck (Vans, Pickup Trucks, SUVs)","GasolineHeavy-Duty Vehicle","DieselPassenger Car","DieselLight Truck (Vans, Pickup Trucks, SUVs)","DieselHeavy-Duty Vehicle",null,null,{"$f":"K175&K176","v":"GasolinePassenger Car"},{"$f":"L175&L176","v":"GasolineLight Truck (Vans, Pickup Trucks, SUVs)"},"GasolineHeavy-Duty Vehicle","DieselPassenger Car","DieselLight Truck (Vans, Pickup Trucks, SUVs)","DieselHeavy-Duty Vehicle"]
[null,1980,{"$f":"C182","v":7.0400000000000004E-2},{"$f":"D185","v":8.1299999999999997E-2},{"$f":"E179","v":0.40899999999999997},5.9999999999999995E-4,1.1000000000000001E-3,5.1000000000000004E-3,null,1980,{"$f":"K182","v":6.4699999999999994E-2},{"$f":"L182","v":0.10349999999999999},{"$f":"M179","v":5.1499999999999997E-2},1.1999999999999999E-3,1.6999999999999999E-3,4.7999999999999996E-3]
[null,1981,{"$f":"C183","v":7.0400000000000004E-2},{"$f":"D186","v":8.1299999999999997E-2},{"$f":"E180","v":0.40899999999999997},5.9999999999999995E-4,1.1000000000000001E-3,5.1000000000000004E-3,null,1981,{"$f":"K183","v":6.4699999999999994E-2},0.10349999999999999,{"$f":"M180","v":5.1499999999999997E-2},1.1999999999999999E-3,1.6999999999999999E-3,4.7999999999999996E-3]
[null,1982,{"$f":"C184","v":7.0400000000000004E-2},8.1299999999999997E-2,{"$f":"E181","v":0.40899999999999997},5.9999999999999995E-4,1.1000000000000001E-3,5.1000000000000004E-3,null,1982,6.4699999999999994E-2,0.10349999999999999,{"$f":"M181","v":5.1499999999999997E-2},1.1999999999999999E-3,1.6999999999999999E-3,4.7999999999999996E-3]
[null,1983,{"$f":"C185","v":7.0400000000000004E-2},8.1299999999999997E-2,{"$f":"E182","v":0.40899999999999997},5.0000000000000001E-4,8.9999999999999998E-4,5.1000000000000004E-3,null,1983,6.4699999999999994E-2,0.10349999999999999,{"$f":"M182","v":5.1499999999999997E-2},1E-3,1.4E-3,4.7999999999999996E-3]
[null,1984,7.0400000000000004E-2,8.1299999999999997E-2,{"$f":"E183","v":0.40899999999999997},5.0000000000000001E-4,8.9999999999999998E-4,5.1000000000000004E-3,null,1984,6.4699999999999994E-2,{"$f":"L186","v":0.10349999999999999},{"$f":"M183","v":5.1499999999999997E-2},1E-3,1.4E-3,4.7999999999999996E-3]
[null,1985,7.0400000000000004E-2,8.1299999999999997E-2,0.40899999999999997,5.0000000000000001E-4,8.9999999999999998E-4,5.1000000000000004E-3,null,1985,6.4699999999999994E-2,{"$f":"L187","v":0.10349999999999999},5.1499999999999997E-2,1E-3,1.4E-3,4.7999999999999996E-3]
[null,1986,7.0400000000000004E-2,8.1299999999999997E-2,0.40899999999999997,5.0000000000000001E-4,8.9999999999999998E-4,5.1000000000000004E-3,null,1986,6.4699999999999994E-2,{"$f":"L188","v":0.10349999999999999},5.1499999999999997E-2,1E-3,1.4E-3,4.7999999999999996E-3]
[null,1987,7.0400000000000004E-2,8.1299999999999997E-2,0.36749999999999999,5.0000000000000001E-4,8.9999999999999998E-4,5.1000000000000004E-3,null,1987,6.4699999999999994E-2,0.10349999999999999,8.4900000000000003E-2,1E-3,1.4E-3,4.7999999999999996E-3]
[null,1988,7.0400000000000004E-2,8.1299999999999997E-2,0.34920000000000001,5.0000000000000001E-4,8.9999999999999998E-4,5.1000000000000004E-3,null,1988,6.4699999999999994E-2,0.10349999999999999,9.3299999999999994E-2,1E-3,1.4E-3,4.7999999999999996E-3]
[null,1989,7.0400000000000004E-2,8.1299999999999997E-2,0.34920000000000001,5.0000000000000001E-4,8.9999999999999998E-4,5.1000000000000004E-3,null,1989,6.4699999999999994E-2,0.10349999999999999,9.3299999999999994E-2,1E-3,1.4E-3,4.7999999999999996E-3]
[null,1990,7.0400000000000004E-2,8.1299999999999997E-2,0.3246,5.0000000000000001E-4,8.9999999999999998E-4,5.1000000000000004E-3,null,1990,6.4699999999999994E-2,0.10349999999999999,0.1142,1E-3,1.4E-3,4.7999999999999996E-3]
[null,1991,7.0400000000000004E-2,8.1299999999999997E-2,0.3246,5.0000000000000001E-4,8.9999999999999998E-4,5.1000000000000004E-3,null,1991,6.4699999999999994E-2,0.10349999999999999,0.1142,1E-3,1.4E-3,4.7999999999999996E-3]
[null,1992,7.0400000000000004E-2,8.1299999999999997E-2,0.3246,5.0000000000000001E-4,8.9999999999999998E-4,5.1000000000000004E-3,null,1992,6.4699999999999994E-2,0.10349999999999999,0.1142,1E-3,1.4E-3,4.7999999999999996E-3]
[null,1993,7.0400000000000004E-2,8.1299999999999997E-2,0.3246,5.0000000000000001E-4,8.9999999999999998E-4,5.1000000000000004E-3,null,1993,6.4699999999999994E-2,0.10349999999999999,0.1142,1E-3,1.4E-3,4.7999999999999996E-3]
[null,1994,5.3100000000000001E-2,6.4600000000000005E-2,0.3246,5.0000000000000001E-4,8.9999999999999998E-4,5.1000000000000004E-3,null,1994,5.6000000000000001E-2,9.8199999999999996E-2,0.1142,1E-3,1.4E-3,4.7999999999999996E-3]
[null,1995,3.5799999999999998E-2,5.1700000000000003E-2,0.3246,5.0000000000000001E-4,8.9999999999999998E-4,5.1000000000000004E-3,null,1995,4.7300000000000002E-2,9.0800000000000006E-2,0.1142,1E-3,1.4E-3,4.7999999999999996E-3]
[null,1996,2.7199999999999998E-2,4.5199999999999997E-2,0.1278,5.0000000000000001E-4,1E-3,5.1000000000000004E-3,null,1996,4.2599999999999999E-2,8.7099999999999997E-2,0.16800000000000001,1E-3,1.5E-3,4.7999999999999996E-3]
[null,1997,2.6800000000000001E-2,4.5199999999999997E-2,9.2399999999999996E-2,5.0000000000000001E-4,1E-3,5.1000000000000004E-3,null,1997,4.2200000000000001E-2,8.7099999999999997E-2,0.1726,1E-3,1.5E-3,4.7999999999999996E-3]
[null,1998,2.4899999999999999E-2,3.9100000000000003E-2,6.4100000000000004E-2,5.0000000000000001E-4,1E-3,5.1000000000000004E-3,null,1998,3.9300000000000002E-2,7.2800000000000004E-2,0.16930000000000001,1E-3,1.5E-3,4.7999999999999996E-3]
[null,1999,2.1600000000000001E-2,3.2099999999999997E-2,5.7799999999999997E-2,5.0000000000000001E-4,1E-3,5.1000000000000004E-3,null,1999,3.3700000000000001E-2,5.6399999999999999E-2,0.14349999999999999,1E-3,1.5E-3,4.7999999999999996E-3]
[null,2000,1.78E-2,3.4599999999999999E-2,4.9299999999999997E-2,5.0000000000000001E-4,1E-3,5.1000000000000004E-3,null,2000,2.7300000000000001E-2,6.2100000000000002E-2,0.10920000000000001,1E-3,1.5E-3,4.7999999999999996E-3]
[null,2001,1.0999999999999999E-2,1.5100000000000001E-2,5.28E-2,5.0000000000000001E-4,1E-3,5.1000000000000004E-3,null,2001,1.5800000000000002E-2,1.6400000000000001E-2,0.1235,1E-3,1.5E-3,4.7999999999999996E-3]
[null,2002,1.0699999999999999E-2,1.78E-2,5.4600000000000003E-2,5.0000000000000001E-4,1E-3,5.1000000000000004E-3,null,2002,1.5299999999999999E-2,2.2800000000000001E-2,0.13070000000000001,1E-3,1.5E-3,4.7999999999999996E-3]
[null,2003,1.14E-2,1.55E-2,5.33E-2,5.0000000000000001E-4,1E-3,5.1000000000000004E-3,null,2003,1.35E-2,1.14E-2,0.124,1E-3,1.5E-3,4.7999999999999996E-3]
[null,2004,1.4500000000000001E-2,1.52E-2,3.4099999999999998E-2,5.0000000000000001E-4,1E-3,5.1000000000000004E-3,null,2004,8.3000000000000001E-3,1.32E-2,2.8500000000000001E-2,1E-3,1.5E-3,4.7999999999999996E-3]
[null,2005,1.47E-2,1.5699999999999999E-2,3.2599999999999997E-2,5.0000000000000001E-4,1E-3,5.1000000000000004E-3,null,2005,7.9000000000000008E-3,1.01E-2,1.77E-2,1E-3,1.5E-3,4.7999999999999996E-3]
[null,2006,1.61E-2,1.5900000000000001E-2,3.2599999999999997E-2,5.0000000000000001E-4,1E-3,5.1000000000000004E-3,null,2006,5.7000000000000002E-3,8.8999999999999999E-3,1.7500000000000002E-2,1E-3,1.5E-3,4.7999999999999996E-3]
[null,2007,1.7000000000000001E-2,1.61E-2,3.27E-2,5.0000000000000001E-4,1E-3,5.1000000000000004E-3,null,2007,4.1000000000000003E-3,7.9000000000000008E-3,1.7299999999999999E-2,1E-3,1.5E-3,4.7999999999999996E-3]
[null,2008,1.72E-2,1.6299999999999999E-2,3.27E-2,5.0000000000000001E-4,1E-3,5.1000000000000004E-3,null,2008,3.8E-3,6.6E-3,1.7100000000000001E-2,1E-3,1.5E-3,4.7999999999999996E-3]
[null,2009,{"$f":"C206","v":1.72E-2},1.6299999999999999E-2,3.27E-2,5.0000000000000001E-4,1E-3,5.1000000000000004E-3,null,2009,{"$f":"K206","v":3.8E-3},6.6E-3,1.7100000000000001E-2,1E-3,1.5E-3,4.7999999999999996E-3]
[null,2010,1.72E-2,1.6299999999999999E-2,3.27E-2,5.0000000000000001E-4,1E-3,5.1000000000000004E-3,null,2010,3.8E-3,6.6E-3,1.7100000000000001E-2,1E-3,1.5E-3,4.7999999999999996E-3]
[null,2011,1.72E-2,1.6299999999999999E-2,3.27E-2,5.0000000000000001E-4,1E-3,5.1000000000000004E-3,null,2011,3.8E-3,6.6E-3,1.7100000000000001E-2,1E-3,1.5E-3,4.7999999999999996E-3]
[null,2012,1.72E-2,1.6299999999999999E-2,3.27E-2,5.0000000000000001E-4,1E-3,5.1000000000000004E-3,null,2012,3.8E-3,6.6E-3,1.7100000000000001E-2,1E-3,1.5E-3,4.7999999999999996E-3]
[null,2013,{"$f":"C210","v":1.72E-2},1.6299999999999999E-2,3.27E-2,5.0000000000000001E-4,1E-3,5.1000000000000004E-3,null,2013,{"$f":"K210","v":3.8E-3},6.6E-3,1.7100000000000001E-2,1E-3,1.5E-3,4.7999999999999996E-3]
[null,2014,{"$f":"C211","v":1.72E-2},1.6299999999999999E-2,3.27E-2,5.0000000000000001E-4,1E-3,5.1000000000000004E-3,null,2014,{"$f":"K211","v":3.8E-3},6.6E-3,1.7100000000000001E-2,1E-3,1.5E-3,4.7999999999999996E-3]
[null,2015,{"$f":"C212","v":1.72E-2},1.6299999999999999E-2,3.27E-2,5.0000000000000001E-4,1E-3,5.1000000000000004E-3,null,2015,{"$f":"K212","v":3.8E-3},6.6E-3,1.7100000000000001E-2,1E-3,1.5E-3,4.7999999999999996E-3]
[null,2016,{"$f":"C213","v":1.72E-2},1.6299999999999999E-2,3.27E-2,5.0000000000000001E-4,1E-3,5.1000000000000004E-3,null,2016,{"$f":"K213","v":3.8E-3},6.6E-3,1.7100000000000001E-2,1E-3,1.5E-3,4.7999999999999996E-3]
[null,2017,{"$f":"C214","v":1.72E-2},1.6299999999999999E-2,3.27E-2,5.0000000000000001E-4,1E-3,5.1000000000000004E-3,null,2017,{"$f":"K214","v":3.8E-3},6.6E-3,1.7100000000000001E-2,1E-3,1.5E-3,4.7999999999999996E-3]
[null,2018,{"$f":"C215","v":1.72E-2},1.6299999999999999E-2,3.27E-2,5.0000000000000001E-4,1E-3,5.1000000000000004E-3,null,2018,{"$f":"K215","v":3.8E-3},6.6E-3,1.7100000000000001E-2,1E-3,1.5E-3,4.7999999999999996E-3]
[null,2019,{"$f":"C216","v":1.72E-2},1.6299999999999999E-2,3.27E-2,5.0000000000000001E-4,1E-3,5.1000000000000004E-3,null,2019,{"$f":"K216","v":3.8E-3},6.6E-3,1.7100000000000001E-2,1E-3,1.5E-3,4.7999999999999996E-3]
[null,2020,{"$f":"C217","v":1.72E-2},1.6299999999999999E-2,3.27E-2,5.0000000000000001E-4,1E-3,5.1000000000000004E-3,null,2020,{"$f":"K217","v":3.8E-3},6.6E-3,1.7100000000000001E-2,1E-3,1.5E-3,4.7999999999999996E-3]
[]
[]
["Default CH4 and N2O Emission Factors for Alternative Fuel Vehicles"]
[]
[null,"CH4 (g/mi)","Passenger Car","Light Truck (Vans, Pickup Trucks, SUVs)","Heavy-Duty Vehicle",null,"N2O (g/mi)","Passenger Car","Light-Duty Vehicle","Heavy-Duty Vehicle"]
[null,"Methanol",1.7999999999999999E-2,1.7999999999999999E-2,6.6000000000000003E-2,null,"Methanol",6.7000000000000004E-2,6.7000000000000004E-2,0.17499999999999999]
[null,"CNG",0.73699999999999999,0.73699999999999999,1.966,null,"CNG",0.05,0.05,0.17499999999999999]
[null,"LNG","NA","NA",1.966,null,"LNG","NA","NA",0.17499999999999999]
[null,"LPG",3.6999999999999998E-2,3.6999999999999998E-2,6.6000000000000003E-2,null,"LPG",6.7000000000000004E-2,6.7000000000000004E-2,0.17499999999999999]
[null,"Ethanol (E85)",5.5E-2,5.5E-2,0.19700000000000001,null,"Ethanol (E85)",6.7000000000000004E-2,6.7000000000000004E-2,0.17499999999999999]
[null,"Biodiesel (B5)",1E-3,1E-3,5.0000000000000001E-3,null,"Biodiesel (B5)",1E-3,1E-3,5.0000000000000001E-3,"equal to B20?"]
[null,"Biodiesel (B20)",1E-3,1E-3,5.0000000000000001E-3,null,"Biodiesel (B20)",1E-3,1E-3,5.0000000000000001E-3]
[]
[]
["Non-CO2 Emission Factors for Other Vehicles"]
[null,"CH4 (g/gallon fuel)",null,null,null,null,"N2O (g/gallon fuel)"]
["Vehicle Types","Gasoline","Diesel","Residual Fuel","Jet Fuel","Aviation Gasoline","Gasoline","Diesel","Residual Fuel","Jet Fuel","Aviation Gasoline"]
["Motorcycles (1996 +)",6.7199999999999996E-2,null,null,null,null,6.8999999999999999E-3,null,null,null,null,"VMT"]
["Motorcycles (- 1995)",8.9899999999999994E-2,null,null,null,null,8.6999999999999994E-3,null,null,null,null,"VMT"]
["Agricultural Equipment",1.26,1.44,null,null,null,0.22,0.26,null,null,null,"gal"]
["Construction Equipment",0.5,0.57999999999999996,null,null,null,0.22,0.26,null,null,null,"gal"]
["Utility and Recreational Equipment",0.5,0.57999999999999996,null,null,null,0.22,0.26,null,null,null,"gal"]
["Aircraft",null,null,null,0.27,7.04,null,null,null,0.31,0.11,"gal"]
["Ships and Boats",0.64,0.74,0.86,null,null,0.22,0.26,0.3,null,null,"gal"]
["Locomotives",null,0.8,null,null,null,null,0.26,null,null,null,"gal"]
[]
[]
["Source (all except motorcycles): CARB (California Air Resources Board). 2010. Local Government Operations Protocol, Version 1.1. California Air Resources Board, California Climate Action Registry, ICLEI, and The Climate Registry."]
["Source (motorcycles): U.S. EPA. 2012. Inventory of U.S. Greenhouse Gas Emissions and Sinks: 1990-2010. Office of Atmospheric Programs, U.S. Environmental Protection Agency. EPA 430-R-06-002."]
[]
[]
["Wastewater"]
[]
["Default Factors Used to Calculate Emissions from Wastewater Treatment"]
[]
["Variable Description","Shorthand","Value",null,null,"Used in Equation…"]
["Density of Methane","p(CH4)",662,null,null,10.1,10.199999999999999]
["CH4 Destruction Efficiency","DE",0.99,null,null,10.1,10.199999999999999]
["Default biogas production","Digester Gas",1]
["Fraction of CH4 in Biogas (default)","F CH4 default",0.65,null,null,null,10.199999999999999]
["Maximum CH4 Production Capacity","Bo",0.6,null,null,null,null,10.3,10.4,10.5,10.6]
["Anaerobic CH4 Correction Factor","MCF anaerobic",0.8,null,null,null,null,10.3,10.4]
["Industrial Discharge Factor","F ind",1.25,null,null,null,null,null,10.4,null,null,10.7,10.8,null,10.1]
["Default fraction BOD5 removed in primary treatment","F p",0.32500000000000001,null,null,null,null,null,10.4]
["Septic CH4 Correction Factor","MCF septic",0.5,null,null,null,null,null,null,10.5,10.6]
["Default BOD5 Load","BOD5 load",0.09,null,null,null,null,null,null,null,10.6,null,null,null,10.1]
["Emissions Factor, Nitrification/Denitrification","EF nit/denit",7,null,null,null,null,null,null,null,null,10.7]
["Emissions Factor, no Nitrification/Denitrification","EF no nit/denit",3.2,null,null,null,null,null,null,null,null,null,10.8]
["Emissions Factor, Effluent","EF effluent",5.0000000000000001E-3,null,null,null,null,null,null,null,null,null,null,10.9,10.1]
["Molecular Weight Ratio of N2O to N2","N2O/N2",{"$f":"44/28","v":1.5714285714285714},null,null,null,null,null,null,null,null,null,null,10.9,10.1]
["Total N Load","N Load",2.5999999999999999E-2,null,null,null,null,null,null,null,null,null,null,null,10.1]
["Nitrogen uptake in aerobic system","N uptake aerobic",0.05,null,null,null,null,null,null,null,null,null,null,null,10.1]
["Nitrogen uptake in anaerobic systems","N uptake anaerobic",5.0000000000000001E-3,null,null,null,null,null,null,null,null,null,null,null,10.1]
["Fraction of nitrogen removed with nitrification/denitrification","Nit/denit default",0.7,null,null,null,null,null,null,null,null,null,null,null,10.1]
["Fraction of nitrogen removed without nit/denit","No Nit/denit default",0,null,null,null,null,null,null,null,null,null,null,null,10.1]
[]
["Source: CARB (California Air Resources Board). 2010. Local Government Operations Protocol, Version 1.1. California Air Resources Board, California Climate Action Registry, ICLEI – Local Governments for Sustainability, and The Climate Registry."]
[]
["Employee Commute"]
[]
["Employee Commute Factors - For simplicity, assumes all modes use gasoline, and all alternative transportation options have effective emissions of zero."]
[null,null,null,null,null,null,"Old Table Rows"]
["Mode","Average mpg","people/mode","kg CO2/gal",null,null,"Mode","Average mpg","people/mode","kg CO2/gal"]
["Single Occupancy Vehicle",21.6,1,8.7799999999999994,null,null,"Single Occupancy Vehicle",20.5,1,8.7799999999999994]
["Carpool",21.6,{"$f":"K286","v":2.4160314135984864},8.7799999999999994,null,null,"Carpool",20.5,2.4980000000000002,8.7799999999999994]
["Motorcycle",43.4,1,8.7799999999999994,null,null,"Motorcycle",56.5,1,8.7799999999999994]
["Transit",null,null,0,null,null,"carpool calculation",null,null,null,"Weighted Average"]
["Bike",null,null,0,null,null,"      In 2-person carpool",null,null,10382478,{"$f":"((2*J286)+(3*J287)+(4*J288)+(5.5*J289)+(7*J290))/J291","v":2.4160314135984864}]
["Walk",null,null,0,null,null,"      In 3-person carpool",null,null,1759044]
["Work at home",null,null,0,null,null,"      In 4-person carpool",null,null,641090]
["Other",null,null,0,null,null,"      In 5- or 6-person carpool",null,null,330934]
[null,null,null,null,null,null,"      In 7-or-more-person carpool",null,null,274032]
["Sources:",null,null,null,null,null,"Total",null,null,{"$f":"SUM(J286:J290)","v":13387578}]
["Average Fuel Efficiency of each Mode: FHWA (Federal Highway Administration). 2012. Highway Statistics 2010. Federal Highway Administration, U.S. Department of Transportation. "]
["Average Number of Carpoolers: U.S. Census Bureau. 2008. American Community Survey"]
["CO2 per Gallon of Gasoline: CARB (California Air Resources Board). 2010. Local Government Operations Protocol, Version 1.1. California Air Resources Board, California Climate Action Registry, ICLEI, and The Climate Registry."]
[]
["Water"]
[]
["Electricity Use in Southern California Water Systems- Average used to develop calculations in the Water worksheet"]
["Table C‐4: Potential Adjustments to WER Table 1‐3, Electricity Use in Typical Urban Water Systems (CEC 2006)"]
["Southern California (kWh/MG) ",null,"kWh/MG"]
[null,"Adjusted","w/ Losses"]
["SWP west branch",7900,9231.5353195579046]
["SWP east branch",9900,11568.632868813071]
["MWD west branch",906,1013.4051898125902]
["MWD east branch",540,604.01633829889477]
[]
["Source: CEC (California Energy Commission). 2006. Refining Estimates of Water-Related Energy Use in California. California Energy Commission. CEC-500-2006-118."]
[]
["eGRID Electricity Emission Factors"]
[{"$f":"'Control Sheet'!D44","v":0},"(lb/MWh)"]
["Gas",2000,2001,2002,2003,2004,2005,2006,2007,2008,2009,2010,2011,2012,2013,2014,2015,2016,2017,2018,2019,2020]
["CO2",{"$f":"IFERROR(VLOOKUP('Control Sheet'!$D$44, elec_factors_CO2, B$311-1997, FALSE),\"\")","v":""},{"$f":"IFERROR(VLOOKUP('Control Sheet'!$D$44, elec_factors_CO2, C$311-1997, FALSE),\"\")","v":""},{"$f":"IFERROR(VLOOKUP('Control Sheet'!$D$44, elec_factors_CO2, D$311-1997, FALSE),\"\")","v":""},{"$f":"IFERROR(VLOOKUP('Control Sheet'!$D$44, elec_factors_CO2, E$311-1997, FALSE),\"\")","v":""},{"$f":"IFERROR(VLOOKUP('Control Sheet'!$D$44, elec_factors_CO2, F$311-1997, FALSE),\"\")","v":""},{"$f":"IFERROR(VLOOKUP('Control Sheet'!$D$44, elec_factors_CO2, G$311-1997, FALSE),\"\")","v":""},{"$f":"IFERROR(VLOOKUP('Control Sheet'!$D$44, elec_factors_CO2, H$311-1997, FALSE),\"\")","v":""},{"$f":"IFERROR(VLOOKUP('Control Sheet'!$D$44, elec_factors_CO2, I$311-1997, FALSE),\"\")","v":""},{"$f":"I312","v":""},{"$f":"J312","v":""},{"$f":"K312","v":""},{"$f":"L312","v":""},{"$f":"M312","v":""},{"$f":"N312","v":""},{"$f":"O312","v":""},{"$f":"P312","v":""},{"$f":"Q312","v":""},{"$f":"R312","v":""},{"$f":"S312","v":""},{"$f":"T312","v":""},{"$f":"U312","v":""}]
["CH4",{"$f":"IFERROR(VLOOKUP('Control Sheet'!$D$44, elec_factors_CH4, B$311-1997, FALSE),\"\")","v":""},{"$f":"IFERROR(VLOOKUP('Control Sheet'!$D$44, elec_factors_CH4, C$311-1997, FALSE),\"\")","v":""},{"$f":"IFERROR(VLOOKUP('Control Sheet'!$D$44, elec_factors_CH4, D$311-1997, FALSE),\"\")","v":""},{"$f":"IFERROR(VLOOKUP('Control Sheet'!$D$44, elec_factors_CH4, E$311-1997, FALSE),\"\")","v":""},{"$f":"IFERROR(VLOOKUP('Control Sheet'!$D$44, elec_factors_CH4, F$311-1997, FALSE),\"\")","v":""},{"$f":"IFERROR(VLOOKUP('Control Sheet'!$D$44, elec_factors_CH4, G$311-1997, FALSE),\"\")","v":""},{"$f":"IFERROR(VLOOKUP('Control Sheet'!$D$44, elec_factors_CH4, H$311-1997, FALSE),\"\")","v":""},{"$f":"IFERROR(VLOOKUP('Control Sheet'!$D$44, elec_factors_CH4, I$311-1997, FALSE),\"\")","v":""},{"$f":"I313","v":""},{"$f":"J313","v":""},"","","","","","","","",{"$f":"S313","v":""},{"$f":"T313","v":""},{"$f":"U313","v":""}]
["N2O",{"$f":"IFERROR(VLOOKUP('Control Sheet'!$D$44, elec_factors_N2O, B$311-1997, FALSE),\"\")","v":""},{"$f":"IFERROR(VLOOKUP('Control Sheet'!$D$44, elec_factors_N2O, C$311-1997, FALSE),\"\")","v":""},{"$f":"IFERROR(VLOOKUP('Control Sheet'!$D$44, elec_factors_N2O, D$311-1997, FALSE),\"\")","v":""},{"$f":"IFERROR(VLOOKUP('Control Sheet'!$D$44, elec_factors_N2O, E$311-1997, FALSE),\"\")","v":""},{"$f":"IFERROR(VLOOKUP('Control Sheet'!$D$44, elec_factors_N2O, F$311-1997, FALSE),\"\")","v":""},{"$f":"IFERROR(VLOOKUP('Control Sheet'!$D$44, elec_factors_N2O, G$311-1997, FALSE),\"\")","v":""},{"$f":"IFERROR(VLOOKUP('Control Sheet'!$D$44, elec_factors_N2O, H$311-1997, FALSE),\"\")","v":""},{"$f":"IFERROR(VLOOKUP('Control Sheet'!$D$44, elec_factors_N2O, I$311-1997, FALSE),\"\")","v":""},{"$f":"I314","v":""},{"$f":"J314","v":""},"","","","","","","","",{"$f":"S314","v":""},{"$f":"T314","v":""},{"$f":"U314","v":""}]
[]
["Source: Emissions & Generation Resource Integrated Database (eGRID). http://www.epa.gov/cleanenergy/energy-resources/egrid/index.html. "]
[]
["Land Use Factors"]
[]
["Emission Factors For N2O"]
["Fertilizer Type","Percent N Content","Percent N lost to Volatilization","Percent N Leach and Runoff","Percent from Applied N","Percent from Volatized N","Percent from Leached and Runoff N"]
[]
["Synthetic",1,0.1,0.3,1.2500000000000001E-2,0.01,2.5000000000000001E-2]
["Organic",3.6999999999999998E-2,0.2,0.3,1.2500000000000001E-2,0.01,2.5000000000000001E-2]
["Manure",5.0000000000000001E-3,0.2,0.3,1.2500000000000001E-2,0.01,2.5000000000000001E-2]
["Sources: Unless otherwise noted, all fertilizer emission factors are IPCC default values from the Revised 1996 Guidelines for National GHG Inventories."]
["Fertilizer Emissions = ","((Fertilizer Consumption in the Park)*(Percent N Content)*(1-Percent N lost to Volatilization)*(Percent from Applied N)+(Fertilizer Consumption in the Park)*(Percent N Content)*(Percent N lost to Volatilization)*(Percent from Volatized N)+(Fertilizer Consumption in the Park)*(Percent N content)*(1-Percent N lost to Volatilization)*(Percent N Leach and Runoff)*(Percent from Leached and Runoff))"]
[]
[null,"N2O/N2O-N",{"$f":"44/28","v":1.5714285714285714}]
[]
["Carbon Sequestration Factor",2.23,"(metric ton C/hectare/year)"]
["Source: EPA State Inventory Tools, Land-Use Land Use Change and Forestry module."]

{"sheet":"Background Controls","index":32,"n_rows":68,"n_cols":21,"rows_kept":68,"cut":false,"hidden":true,"merged":[]}
["Background Controls"]
[null,null,null,null,null,null,null,null,"Lists"]
[null,null,null,null,null,null,null,null,{"$f":"MyDepartmentCount","v":1}]
["Tool Name","Local Inventory Tool",null,null,null,null,null,null,"Department","Landfills",null,null,null,"Stationary Fuels","Facility Types","Water Importers","Comprehensive/Partial","Yes/No","Scope",null,"Emission Factors Choice"]
["Version Number",1,null,null,null,null,null,null,{"$f":"'Control Sheet'!D16","v":0},{"$f":"'Solid Waste-Control'!C28","v":0},null,null,null,"Natural Gas","Office Building","SWP west branch",null,null,1,null,true]
[null,null,null,null,null,null,null,null,{"$f":"'Control Sheet'!D17","v":0},{"$f":"'Solid Waste-Control'!C29","v":0},null,null,null,"Diesel","Warehouse","SWP east branch","Comprehensive","Yes",2,null,true]
[null,null,null,null,null,null,null,null,{"$f":"'Control Sheet'!D18","v":0},{"$f":"'Solid Waste-Control'!C30","v":0},null,null,null,"Gasoline","Water Infrastructure","MWD west branch","Partial","No",3,null,true]
[null,null,null,null,null,null,null,null,{"$f":"'Control Sheet'!D19","v":0},{"$f":"'Solid Waste-Control'!C31","v":0},null,null,null,"LPG","Wastewater Infrastructure","MWD east branch","N/A",null,null,null,true]
[null,null,null,null,null,null,null,null,{"$f":"'Control Sheet'!D20","v":0},{"$f":"'Solid Waste-Control'!C32","v":0},null,null,null,"Propane","Outdoor Lighting",null,null,null,null,null,true]
[null,null,null,null,null,null,null,null,{"$f":"'Control Sheet'!D21","v":0},{"$f":"'Solid Waste-Control'!C33","v":0},null,null,null,"Butane","School"]
["Mobile Entry Row",{"$f":"ROW(MobCurrentID)+2+COUNTIF('Mobile-Data'!A9:A65536,\">0\")","v":9},null,null,null,null,null,null,{"$f":"'Control Sheet'!D22","v":0},{"$f":"'Solid Waste-Control'!C34","v":0},null,null,null,"Residual Fuel Oil No. 5","Health"]
["Mobile Min Vehicle",{"$f":"IF(OFFSET(MobCurrentID,2,0)=0,0,ROW(OFFSET(MobCurrentID,2,0)))","v":0},null,null,null,null,null,null,{"$f":"'Control Sheet'!D23","v":0},{"$f":"'Solid Waste-Control'!C35","v":0},null,null,null,"Residual Fuel Oil No. 6","Other"]
["Mobile Max Vehicle",{"$f":"mob_EntryRow-1","v":8},null,null,null,null,null,null,{"$f":"'Control Sheet'!D24","v":0},{"$f":"'Solid Waste-Control'!C36","v":0},null,null,null,"Jet Fuel"]
[null,null,null,null,null,null,null,null,{"$f":"'Control Sheet'!D25","v":0},{"$f":"'Solid Waste-Control'!C37","v":0},null,null,null,"Bituminous Coal"]
["Electricity Entry Row",{"$f":"ROW(elec_CurrentID)+2+COUNTIF('Electricity-Data'!A9:A65520,\">0\")","v":9},null,null,null,null,null,null,{"$f":"'Control Sheet'!D26","v":0},null,null,null,null,"Digester Gas"]
["Electricity Min Unit",{"$f":"IF(OFFSET(elec_CurrentID,2,0)=0,0,ROW(OFFSET(elec_CurrentID,2,0)))","v":0},null,null,null,null,null,null,{"$f":"'Control Sheet'!D27","v":0}]
["Electricity Max Unit",{"$f":"elec_EntryRow-1","v":8},null,null,null,null,null,null,{"$f":"'Control Sheet'!D28","v":0},null,null,null,null,null,null,null,null,null,null,null,{"$f":"COUNTIF(U5:U16,TRUE)","v":5}]
["Electricity Lookup Column",{"$f":"MyYear-1998","v":-1998},null,null,null,null,null,null,{"$f":"'Control Sheet'!D29","v":0}]
[null,null,null,null,null,null,null,null,{"$f":"'Control Sheet'!D30","v":0}]
["Stationary Entry Row",{"$f":"ROW(stat_CurrentID)+2+COUNTIF('Stationary-Data'!A9:A24,\">0\")","v":9},null,null,null,null,null,null,{"$f":"'Control Sheet'!D31","v":0}]
["Stationary Min Unit",{"$f":"IF(OFFSET(stat_CurrentID,2,0)=0,0,ROW(OFFSET(stat_CurrentID,2,0)))","v":0},null,null,null,null,null,null,{"$f":"'Control Sheet'!D32","v":0}]
["Stationary Max Unit",{"$f":"stat_EntryRow-1","v":8},null,null,null,null,null,null,{"$f":"'Control Sheet'!D33","v":0}]
[null,null,null,null,null,null,null,null,{"$f":"'Control Sheet'!D34","v":0}]
[null,null,null,null,null,null,null,null,{"$f":"'Control Sheet'!D35","v":0}]
[null,"Fuels"]
["Vehicle Types","Gasoline","Diesel","Biodiesel (B5)","Biodiesel (B20)","Ethanol (E85)","CNG","LNG","LPG","Residual Fuel","Jet Fuel","Aviation Gasoline"]
["Units","Gallons","Gallons","Gallons","Gallons","Gallons","G.G.E.","Gallons","Gallons","Gallons","Gallons","Gallons"]
[{"$f":"mob_entry_vehtype","v":0},{"$f":"VLOOKUP($A$28,$A$29:$L$38,MATCH(B$26,$A$26:$L$26,0),FALSE)","v":{"$error":"#N/A"}},{"$f":"VLOOKUP($A$28,$A$29:$L$38,MATCH(C$26,$A$26:$L$26,0),FALSE)","v":{"$error":"#N/A"}},{"$error":"#N/A"},{"$error":"#N/A"},{"$error":"#N/A"},{"$error":"#N/A"},{"$error":"#N/A"},{"$error":"#N/A"},{"$error":"#N/A"},{"$error":"#N/A"},{"$error":"#N/A"}]
["Passenger Car",1,1,1,1,1,1,null,1]
["Light Truck (Vans, Pickup Trucks, SUVs)",1,1,1,1,1,1,null,1]
["Heavy-Duty Vehicle",1,1,1,1,1,1,1,1]
["Motorcycle",1]
["Agricultural Equipment",1,1]
["Construction Equipment",1,1]
["Utility and Recreational Equipment",1,1]
["Aircraft",null,null,null,null,null,null,null,null,null,1,1]
["Ship or Boat",1,1,null,null,null,null,null,null,1]
["Locomotive",null,1]
[]
[]
[]
[null,"Available Fuels",{"$f":"SUM(B28:L28)","v":{"$error":"#N/A"}}]
[1,{"$f":"EligibleItem($C$42,A43,$B$28:$L$28,$B$26:$L$26)","v":{"$error":"#VALUE!"}}]
[2,{"$f":"EligibleItem($C$42,A44,$B$28:$L$28,$B$26:$L$26)","v":{"$error":"#VALUE!"}}]
[3,{"$error":"#VALUE!"}]
[4,{"$error":"#VALUE!"}]
[5,{"$error":"#VALUE!"}]
[6,{"$error":"#VALUE!"}]
[7,{"$error":"#VALUE!"}]
[8,{"$error":"#VALUE!"}]
[9,{"$error":"#VALUE!"}]
[10,{"$error":"#VALUE!"}]
[11,{"$error":"#VALUE!"}]
[]
[]
[]
[]
["List of Utilities",{"$f":"'Control Sheet'!D46","v":0},{"$f":"'Control Sheet'!D47","v":0},{"$f":"'Control Sheet'!D48","v":0},{"$f":"'Control Sheet'!D49","v":0},{"$f":"'Control Sheet'!D50","v":0}]
[null,{"$f":"IF('Control Sheet'!B46=TRUE,1,0)","v":0},{"$f":"IF('Control Sheet'!B47=TRUE,1,0)","v":0},{"$f":"IF('Control Sheet'!B48=TRUE,1,0)","v":0},{"$f":"IF('Control Sheet'!B49=TRUE,1,0)","v":0},{"$f":"IF('Control Sheet'!B50=TRUE,1,0)","v":0}]
[]
[null,"Selected Utilities",{"$f":"SUM(B59:F59)","v":0}]
[null,{"$f":"'Control Sheet'!D44","v":0}]
[1,{"$f":"EligibleItem($C$61,A63,$B$59:$F$59,$B$58:$F$58)","v":0}]
[2,{"$f":"EligibleItem($C$61,A64,$B$59:$F$59,$B$58:$F$58)","v":0}]
[3,0]
[4,0]
[5,0]
[6,0]

{"sheet":"Help","index":33,"n_rows":1,"n_cols":1,"rows_kept":1,"cut":false,"hidden":true,"merged":[]}
["Help"]

{"sheet":"Detail Type Data","index":34,"n_rows":94,"n_cols":36,"rows_kept":94,"cut":false,"hidden":true,"merged":[[28,3,28,5],[29,9,29,12]]}
[]
[null,"Stationary Fuel Combustion Energy Use (MMBtu)"]
[null,null,"Natural Gas","Diesel","Gasoline","LPG","Propane","Butane","Residual Fuel Oil No. 5","Residual Fuel Oil No. 6","Jet Fuel","Bituminous Coal","Digester Gas","Total"]
[null,null,{"$f":"VLOOKUP(C3, stat_factors, 5, FALSE)","v":1.028},0.13800000000000001,0.125,9.1999999999999998E-2,9.0999999999999998E-2,0.10100000000000001,0.14000000000000001,0.15,0.13500000000000001,24.93,0.84099999999999997]
[null,{"$f":"'Background Controls'!O5","v":"Office Building"},{"$f":"SUMIFS(stat_data_consump, stat_data_bldgtype, $B5, stat_data_FuelType, C$3)*C$4","v":0},0,0,0,0,0,0,0,0,0,0,{"$f":"SUM(C5:M5)","v":0}]
[null,{"$f":"'Background Controls'!O6","v":"Warehouse"},0,0,0,0,0,0,0,0,0,0,0,{"$f":"SUM(C6:M6)","v":0}]
[null,{"$f":"'Background Controls'!O7","v":"Water Infrastructure"},0,0,0,0,0,0,0,0,0,0,0,0]
[null,{"$f":"'Background Controls'!O8","v":"Wastewater Infrastructure"},0,0,0,0,0,0,0,0,0,0,0,0]
[null,{"$f":"'Background Controls'!O9","v":"Outdoor Lighting"},0,0,0,0,0,0,0,0,0,0,0,0]
[null,{"$f":"'Background Controls'!O10","v":"School"},0,0,0,0,0,0,0,0,0,0,0,0]
[null,{"$f":"'Background Controls'!O11","v":"Health"},0,0,0,0,0,0,0,0,0,0,0,0]
[null,{"$f":"'Background Controls'!O12","v":"Other"},0,0,0,0,0,0,0,0,0,0,0,0]
[]
[null,"Electricity Use (kWh) by Building Type"]
[null,null,"kWh","%"]
[null,{"$f":"'Background Controls'!O5","v":"Office Building"},{"$f":"SUMIF(elec_data_bldgtype, B16, elec_data_consump)","v":0},{"$f":"bldgtype_elec_office/bldgtype_elec_total","v":{"$error":"#DIV/0!"}}]
[null,{"$f":"'Background Controls'!O6","v":"Warehouse"},0]
[null,{"$f":"'Background Controls'!O7","v":"Water Infrastructure"},0]
[null,{"$f":"'Background Controls'!O8","v":"Wastewater Infrastructure"},0]
[null,{"$f":"'Background Controls'!O9","v":"Outdoor Lighting"},0]
[null,{"$f":"'Background Controls'!O10","v":"School"},0]
[null,{"$f":"'Background Controls'!O11","v":"Health"},0]
[null,{"$f":"'Background Controls'!O12","v":"Other"},0]
[null,null,{"$f":"SUM(C16:C23)","v":0}]
[]
[]
[]
[null,"Mobile Emissions by Vehicle Type",null,null,null,null,null,null,null,{"$f":"\"Temporary Values - Current Department \"&mob_nonCO2_current_dept","v":"Temporary Values - Current Department 0"}]
[null,"Type","Fuel","CO2",null,null,"Non-CO2","Total",null,"Type","Fuel","CH4","N2O","Total",null,"Total Non-CO2"]
[null,null,null,"% fuel type use by vehicle type","Total Fuel Type Emissions","CO2 emissions",null,null,null,"*Note: formulas are not drag-able*",null,null,null,null,null,{"$f":"'Background Controls'!$I$5","v":0},{"$f":"'Background Controls'!$I$6","v":0},{"$f":"'Background Controls'!$I$7","v":0},{"$f":"'Background Controls'!$I$8","v":0},{"$f":"'Background Controls'!$I$9","v":0},{"$f":"'Background Controls'!$I$10","v":0},{"$f":"'Background Controls'!$I$11","v":0},{"$f":"'Background Controls'!$I$12","v":0},{"$f":"'Background Controls'!$I$13","v":0},{"$f":"'Background Controls'!$I$14","v":0},{"$f":"'Background Controls'!$I$15","v":0},{"$f":"'Background Controls'!$I$16","v":0},{"$f":"'Background Controls'!$I$17","v":0},{"$f":"'Background Controls'!$I$18","v":0},{"$f":"'Background Controls'!$I$19","v":0},{"$f":"'Background Controls'!$I$20","v":0},{"$f":"'Background Controls'!$I$21","v":0},{"$f":"'Background Controls'!$I$22","v":0},{"$f":"'Background Controls'!$I$23","v":0},{"$f":"'Background Controls'!$I$24","v":0},"SUM"]
[null,"Passenger Car","Gasoline",{"$f":"IF(SUMIF('Mobile-Data'!$G$9:$G$1048576,C31, 'Mobile-Data'!$H$9:$H$1048576)=0,0,SUMIFS('Mobile-Data'!$H$9:$H$1048576, 'Mobile-Data'!$E$9:$E$1048576,B31, 'Mobile-Data'!$G$9:$G$1048576,C31)/SUMIF('Mobile-Data'!$G$9:$G$1048576,C31, 'Mobile-Data'!$H$9:$H$1048576))","v":0},{"$f":"'Mobile-Detail Calcs'!$C$149","v":0},{"$f":"D31*E31","v":0},{"$f":"AJ31","v":0},{"$f":"SUM(F31:G31)","v":0},null,"Passenger Car","Gasoline",{"$f":"'Mobile-Detail Calcs'!L210","v":0},{"$f":"'Mobile-Detail Calcs'!$U$210","v":0},{"$f":"SUM(L31:M31)","v":0},null,0,0,0,0,0,0,0,0,0,0,0,0,0,0,0,0,0,0,0,0,{"$f":"SUM(P31:AI31)","v":0}]
[null,"Light Truck (Vans, Pickup Trucks, SUVs)","Gasoline",{"$f":"IF(SUMIF('Mobile-Data'!$G$9:$G$1048576,C32, 'Mobile-Data'!$H$9:$H$1048576)=0,0,SUMIFS('Mobile-Data'!$H$9:$H$1048576, 'Mobile-Data'!$E$9:$E$1048576,B32, 'Mobile-Data'!$G$9:$G$1048576,C32)/SUMIF('Mobile-Data'!$G$9:$G$1048576,C32, 'Mobile-Data'!$H$9:$H$1048576))","v":0},{"$f":"'Mobile-Detail Calcs'!$C$149","v":0},{"$f":"D32*E32","v":0},{"$f":"AJ32","v":0},{"$f":"SUM(F32:G32)","v":0},null,"Light Truck (Vans, Pickup Trucks, SUVs)","Gasoline",{"$f":"'Mobile-Detail Calcs'!M210","v":0},{"$f":"'Mobile-Detail Calcs'!$V$210","v":0},{"$f":"SUM(L32:M32)","v":0},null,0,0,0,0,0,0,0,0,0,0,0,0,0,0,0,0,0,0,0,0,{"$f":"SUM(P32:AI32)","v":0}]
[null,"Heavy-Duty Vehicle","Gasoline",{"$f":"IF(SUMIF('Mobile-Data'!$G$9:$G$1048576,C33, 'Mobile-Data'!$H$9:$H$1048576)=0,0,SUMIFS('Mobile-Data'!$H$9:$H$1048576, 'Mobile-Data'!$E$9:$E$1048576,B33, 'Mobile-Data'!$G$9:$G$1048576,C33)/SUMIF('Mobile-Data'!$G$9:$G$1048576,C33, 'Mobile-Data'!$H$9:$H$1048576))","v":0},{"$f":"'Mobile-Detail Calcs'!$C$149","v":0},{"$f":"D33*E33","v":0},0,0,null,"Heavy-Duty Vehicle","Gasoline",{"$f":"'Mobile-Detail Calcs'!N210","v":0},{"$f":"'Mobile-Detail Calcs'!$W$210","v":0},0,null,0,0,0,0,0,0,0,0,0,0,0,0,0,0,0,0,0,0,0,0,0]
[null,"Passenger Car","Diesel",{"$f":"IF(SUMIF('Mobile-Data'!$G$9:$G$1048576,C34, 'Mobile-Data'!$H$9:$H$1048576)=0,0,SUMIFS('Mobile-Data'!$H$9:$H$1048576, 'Mobile-Data'!$E$9:$E$1048576,B34, 'Mobile-Data'!$G$9:$G$1048576,C34)/SUMIF('Mobile-Data'!$G$9:$G$1048576,C34, 'Mobile-Data'!$H$9:$H$1048576))","v":0},{"$f":"'Mobile-Detail Calcs'!$D$149","v":0},{"$f":"D34*E34","v":0},0,0,null,"Passenger Car","Diesel",{"$f":"'Mobile-Detail Calcs'!O210","v":0},{"$f":"'Mobile-Detail Calcs'!$X$210","v":0},0,null,0,0,0,0,0,0,0,0,0,0,0,0,0,0,0,0,0,0,0,0,0]
[null,"Light Truck (Vans, Pickup Trucks, SUVs)","Diesel",{"$f":"IF(SUMIF('Mobile-Data'!$G$9:$G$1048576,C35, 'Mobile-Data'!$H$9:$H$1048576)=0,0,SUMIFS('Mobile-Data'!$H$9:$H$1048576, 'Mobile-Data'!$E$9:$E$1048576,B35, 'Mobile-Data'!$G$9:$G$1048576,C35)/SUMIF('Mobile-Data'!$G$9:$G$1048576,C35, 'Mobile-Data'!$H$9:$H$1048576))","v":0},{"$f":"'Mobile-Detail Calcs'!$D$149","v":0},{"$f":"D35*E35","v":0},0,0,null,"Light Truck (Vans, Pickup Trucks, SUVs)","Diesel",{"$f":"'Mobile-Detail Calcs'!P210","v":0},{"$f":"'Mobile-Detail Calcs'!$Y$210","v":0},0,null,0,0,0,0,0,0,0,0,0,0,0,0,0,0,0,0,0,0,0,0,0]
[null,"Heavy-Duty Vehicle","Diesel",{"$f":"IF(SUMIF('Mobile-Data'!$G$9:$G$1048576,C36, 'Mobile-Data'!$H$9:$H$1048576)=0,0,SUMIFS('Mobile-Data'!$H$9:$H$1048576, 'Mobile-Data'!$E$9:$E$1048576,B36, 'Mobile-Data'!$G$9:$G$1048576,C36)/SUMIF('Mobile-Data'!$G$9:$G$1048576,C36, 'Mobile-Data'!$H$9:$H$1048576))","v":0},{"$f":"'Mobile-Detail Calcs'!$D$149","v":0},{"$f":"D36*E36","v":0},1.5865279326000001,1.5865279326000001,null,"Heavy-Duty Vehicle","Diesel",{"$f":"'Mobile-Detail Calcs'!Q210","v":0},{"$f":"'Mobile-Detail Calcs'!$Z$210","v":0},0,null,0,0.74143438200000011,0.74143438200000011,0.1036591686,0,0,0,0,0,0,0,0,0,0,0,0,0,0,0,0,1.5865279326000001]
[null,"Passenger Car","Biodiesel (B5)",{"$f":"IF(SUMIF('Mobile-Data'!$G$9:$G$1048576,C37, 'Mobile-Data'!$H$9:$H$1048576)=0,0,SUMIFS('Mobile-Data'!$H$9:$H$1048576, 'Mobile-Data'!$E$9:$E$1048576,B37, 'Mobile-Data'!$G$9:$G$1048576,C37)/SUMIF('Mobile-Data'!$G$9:$G$1048576,C37, 'Mobile-Data'!$H$9:$H$1048576))","v":0},{"$f":"'Mobile-Detail Calcs'!$E$149","v":0},0,0,0,null,"Passenger Car","Biodiesel (B5)",{"$f":"'Mobile-Detail Calcs'!L220","v":0},{"$f":"'Mobile-Detail Calcs'!U220","v":0},0,null,0,0,0,0,0,0,0,0,0,0,0,0,0,0,0,0,0,0,0,0,0]
[null,"Light Truck (Vans, Pickup Trucks, SUVs)","Biodiesel (B5)",{"$f":"IF(SUMIF('Mobile-Data'!$G$9:$G$1048576,C38, 'Mobile-Data'!$H$9:$H$1048576)=0,0,SUMIFS('Mobile-Data'!$H$9:$H$1048576, 'Mobile-Data'!$E$9:$E$1048576,B38, 'Mobile-Data'!$G$9:$G$1048576,C38)/SUMIF('Mobile-Data'!$G$9:$G$1048576,C38, 'Mobile-Data'!$H$9:$H$1048576))","v":0},{"$f":"'Mobile-Detail Calcs'!$E$149","v":0},{"$f":"D38*E38","v":0},0,0,null,"Light Truck (Vans, Pickup Trucks, SUVs)","Biodiesel (B5)",{"$f":"'Mobile-Detail Calcs'!M220","v":0},{"$f":"'Mobile-Detail Calcs'!V220","v":0},0,null,0,0,0,0,0,0,0,0,0,0,0,0,0,0,0,0,0,0,0,0,0]
[null,"Heavy-Duty Vehicle","Biodiesel (B5)",{"$f":"IF(SUMIF('Mobile-Data'!$G$9:$G$1048576,C39, 'Mobile-Data'!$H$9:$H$1048576)=0,0,SUMIFS('Mobile-Data'!$H$9:$H$1048576, 'Mobile-Data'!$E$9:$E$1048576,B39, 'Mobile-Data'!$G$9:$G$1048576,C39)/SUMIF('Mobile-Data'!$G$9:$G$1048576,C39, 'Mobile-Data'!$H$9:$H$1048576))","v":0},{"$f":"'Mobile-Detail Calcs'!$E$149","v":0},{"$f":"D39*E39","v":0},0,0,null,"Heavy-Duty Vehicle","Biodiesel (B5)",{"$f":"'Mobile-Detail Calcs'!N220","v":0},{"$f":"'Mobile-Detail Calcs'!W220","v":0},0,null,0,0,0,0,0,0,0,0,0,0,0,0,0,0,0,0,0,0,0,0,0]
[null,"Passenger Car","Biodiesel (B20)",{"$f":"IF(SUMIF('Mobile-Data'!$G$9:$G$1048576,C40, 'Mobile-Data'!$H$9:$H$1048576)=0,0,SUMIFS('Mobile-Data'!$H$9:$H$1048576, 'Mobile-Data'!$E$9:$E$1048576,B40, 'Mobile-Data'!$G$9:$G$1048576,C40)/SUMIF('Mobile-Data'!$G$9:$G$1048576,C40, 'Mobile-Data'!$H$9:$H$1048576))","v":0},{"$f":"'Mobile-Detail Calcs'!$F$149","v":0},0,0,0,null,"Passenger Car","Biodiesel (B20)",{"$f":"'Mobile-Detail Calcs'!L221","v":0},{"$f":"'Mobile-Detail Calcs'!U221","v":0},0,null,0,0,0,0,0,0,0,0,0,0,0,0,0,0,0,0,0,0,0,0,0]
[null,"Light Truck (Vans, Pickup Trucks, SUVs)","Biodiesel (B20)",{"$f":"IF(SUMIF('Mobile-Data'!$G$9:$G$1048576,C41, 'Mobile-Data'!$H$9:$H$1048576)=0,0,SUMIFS('Mobile-Data'!$H$9:$H$1048576, 'Mobile-Data'!$E$9:$E$1048576,B41, 'Mobile-Data'!$G$9:$G$1048576,C41)/SUMIF('Mobile-Data'!$G$9:$G$1048576,C41, 'Mobile-Data'!$H$9:$H$1048576))","v":0},{"$f":"'Mobile-Detail Calcs'!$F$149","v":0},{"$f":"D41*E41","v":0},0,0,null,"Light Truck (Vans, Pickup Trucks, SUVs)","Biodiesel (B20)",{"$f":"'Mobile-Detail Calcs'!M221","v":0},{"$f":"'Mobile-Detail Calcs'!V221","v":0},0,null,0,0,0,0,0,0,0,0,0,0,0,0,0,0,0,0,0,0,0,0,0]
[null,"Heavy-Duty Vehicle","Biodiesel (B20)",{"$f":"IF(SUMIF('Mobile-Data'!$G$9:$G$1048576,C42, 'Mobile-Data'!$H$9:$H$1048576)=0,0,SUMIFS('Mobile-Data'!$H$9:$H$1048576, 'Mobile-Data'!$E$9:$E$1048576,B42, 'Mobile-Data'!$G$9:$G$1048576,C42)/SUMIF('Mobile-Data'!$G$9:$G$1048576,C42, 'Mobile-Data'!$H$9:$H$1048576))","v":0},{"$f":"'Mobile-Detail Calcs'!$F$149","v":0},{"$f":"D42*E42","v":0},0,0,null,"Heavy-Duty Vehicle","Biodiesel (B20)",{"$f":"'Mobile-Detail Calcs'!N221","v":0},{"$f":"'Mobile-Detail Calcs'!W221","v":0},0,null,0,0,0,0,0,0,0,0,0,0,0,0,0,0,0,0,0,0,0,0,0]
[null,"Passenger Car","Ethanol (E85)",{"$f":"IF(SUMIF('Mobile-Data'!$G$9:$G$1048576,C43, 'Mobile-Data'!$H$9:$H$1048576)=0,0,SUMIFS('Mobile-Data'!$H$9:$H$1048576, 'Mobile-Data'!$E$9:$E$1048576,B43, 'Mobile-Data'!$G$9:$G$1048576,C43)/SUMIF('Mobile-Data'!$G$9:$G$1048576,C43, 'Mobile-Data'!$H$9:$H$1048576))","v":0},{"$f":"'Mobile-Detail Calcs'!$G$149","v":0},0,0,0,null,"Passenger Car","Ethanol (E85)",{"$f":"'Mobile-Detail Calcs'!L219","v":0},{"$f":"'Mobile-Detail Calcs'!U219","v":0},0,null,0,0,0,0,0,0,0,0,0,0,0,0,0,0,0,0,0,0,0,0,0]
[null,"Light Truck (Vans, Pickup Trucks, SUVs)","Ethanol (E85)",{"$f":"IF(SUMIF('Mobile-Data'!$G$9:$G$1048576,C44, 'Mobile-Data'!$H$9:$H$1048576)=0,0,SUMIFS('Mobile-Data'!$H$9:$H$1048576, 'Mobile-Data'!$E$9:$E$1048576,B44, 'Mobile-Data'!$G$9:$G$1048576,C44)/SUMIF('Mobile-Data'!$G$9:$G$1048576,C44, 'Mobile-Data'!$H$9:$H$1048576))","v":0},{"$f":"'Mobile-Detail Calcs'!$G$149","v":0},{"$f":"D44*E44","v":0},0,0,null,"Light Truck (Vans, Pickup Trucks, SUVs)","Ethanol (E85)",{"$f":"'Mobile-Detail Calcs'!M219","v":0},{"$f":"'Mobile-Detail Calcs'!V219","v":0},0,null,0,0,0,0,0,0,0,0,0,0,0,0,0,0,0,0,0,0,0,0,0]
[null,"Heavy-Duty Vehicle","Ethanol (E85)",{"$f":"IF(SUMIF('Mobile-Data'!$G$9:$G$1048576,C45, 'Mobile-Data'!$H$9:$H$1048576)=0,0,SUMIFS('Mobile-Data'!$H$9:$H$1048576, 'Mobile-Data'!$E$9:$E$1048576,B45, 'Mobile-Data'!$G$9:$G$1048576,C45)/SUMIF('Mobile-Data'!$G$9:$G$1048576,C45, 'Mobile-Data'!$H$9:$H$1048576))","v":0},{"$f":"'Mobile-Detail Calcs'!$G$149","v":0},0,0,0,null,"Heavy-Duty Vehicle","Ethanol (E85)",{"$f":"'Mobile-Detail Calcs'!N219","v":0},{"$f":"'Mobile-Detail Calcs'!W219","v":0},0,null,0,0,0,0,0,0,0,0,0,0,0,0,0,0,0,0,0,0,0,0,0]
[null,"Passenger Car","CNG",{"$f":"IF(SUMIF('Mobile-Data'!$G$9:$G$1048576,C46, 'Mobile-Data'!$H$9:$H$1048576)=0,0,SUMIFS('Mobile-Data'!$H$9:$H$1048576, 'Mobile-Data'!$E$9:$E$1048576,B46, 'Mobile-Data'!$G$9:$G$1048576,C46)/SUMIF('Mobile-Data'!$G$9:$G$1048576,C46, 'Mobile-Data'!$H$9:$H$1048576))","v":0},{"$f":"'Mobile-Detail Calcs'!$H$149","v":0},0,0,0,null,"Passenger Car","CNG",{"$f":"'Mobile-Detail Calcs'!L216","v":0},{"$f":"'Mobile-Detail Calcs'!U216","v":0},0,null,0,0,0,0,0,0,0,0,0,0,0,0,0,0,0,0,0,0,0,0,0]
[null,"Light Truck (Vans, Pickup Trucks, SUVs)","CNG",{"$f":"IF(SUMIF('Mobile-Data'!$G$9:$G$1048576,C47, 'Mobile-Data'!$H$9:$H$1048576)=0,0,SUMIFS('Mobile-Data'!$H$9:$H$1048576, 'Mobile-Data'!$E$9:$E$1048576,B47, 'Mobile-Data'!$G$9:$G$1048576,C47)/SUMIF('Mobile-Data'!$G$9:$G$1048576,C47, 'Mobile-Data'!$H$9:$H$1048576))","v":0},{"$f":"'Mobile-Detail Calcs'!$H$149","v":0},0,0,0,null,"Light Truck (Vans, Pickup Trucks, SUVs)","CNG",{"$f":"'Mobile-Detail Calcs'!M216","v":0},{"$f":"'Mobile-Detail Calcs'!V216","v":0},0,null,0,0,0,0,0,0,0,0,0,0,0,0,0,0,0,0,0,0,0,0,0]
[null,"Heavy-Duty Vehicle","CNG",{"$f":"IF(SUMIF('Mobile-Data'!$G$9:$G$1048576,C48, 'Mobile-Data'!$H$9:$H$1048576)=0,0,SUMIFS('Mobile-Data'!$H$9:$H$1048576, 'Mobile-Data'!$E$9:$E$1048576,B48, 'Mobile-Data'!$G$9:$G$1048576,C48)/SUMIF('Mobile-Data'!$G$9:$G$1048576,C48, 'Mobile-Data'!$H$9:$H$1048576))","v":0},{"$f":"'Mobile-Detail Calcs'!$H$149","v":0},0,0,0,null,"Heavy-Duty Vehicle","CNG",{"$f":"'Mobile-Detail Calcs'!N216","v":0},{"$f":"'Mobile-Detail Calcs'!W216","v":0},0,null,0,0,0,0,0,0,0,0,0,0,0,0,0,0,0,0,0,0,0,0,0]
[null,"Passenger Car","LNG",{"$f":"IF(SUMIF('Mobile-Data'!$G$9:$G$1048576,C49, 'Mobile-Data'!$H$9:$H$1048576)=0,0,SUMIFS('Mobile-Data'!$H$9:$H$1048576, 'Mobile-Data'!$E$9:$E$1048576,B49, 'Mobile-Data'!$G$9:$G$1048576,C49)/SUMIF('Mobile-Data'!$G$9:$G$1048576,C49, 'Mobile-Data'!$H$9:$H$1048576))","v":0},{"$f":"'Mobile-Detail Calcs'!$I$149","v":0},0,0,0,null,"Passenger Car","LNG","-","-",0,null,0,0,0,0,0,0,0,0,0,0,0,0,0,0,0,0,0,0,0,0,0]
[null,"Light Truck (Vans, Pickup Trucks, SUVs)","LNG",{"$f":"IF(SUMIF('Mobile-Data'!$G$9:$G$1048576,C50, 'Mobile-Data'!$H$9:$H$1048576)=0,0,SUMIFS('Mobile-Data'!$H$9:$H$1048576, 'Mobile-Data'!$E$9:$E$1048576,B50, 'Mobile-Data'!$G$9:$G$1048576,C50)/SUMIF('Mobile-Data'!$G$9:$G$1048576,C50, 'Mobile-Data'!$H$9:$H$1048576))","v":0},{"$f":"'Mobile-Detail Calcs'!$I$149","v":0},0,0,0,null,"Light Truck (Vans, Pickup Trucks, SUVs)","LNG","-","-",0,null,0,0,0,0,0,0,0,0,0,0,0,0,0,0,0,0,0,0,0,0,0]
[null,"Heavy-Duty Vehicle","LNG",{"$f":"IF(SUMIF('Mobile-Data'!$G$9:$G$1048576,C51, 'Mobile-Data'!$H$9:$H$1048576)=0,0,SUMIFS('Mobile-Data'!$H$9:$H$1048576, 'Mobile-Data'!$E$9:$E$1048576,B51, 'Mobile-Data'!$G$9:$G$1048576,C51)/SUMIF('Mobile-Data'!$G$9:$G$1048576,C51, 'Mobile-Data'!$H$9:$H$1048576))","v":0},{"$f":"'Mobile-Detail Calcs'!$I$149","v":0},0,0,0,null,"Heavy-Duty Vehicle","LNG",{"$f":"'Mobile-Detail Calcs'!N217","v":0},{"$f":"'Mobile-Detail Calcs'!W217","v":0},0,null,0,0,0,0,0,0,0,0,0,0,0,0,0,0,0,0,0,0,0,0,0]
[null,"Passenger Car","LPG",{"$f":"IF(SUMIF('Mobile-Data'!$G$9:$G$1048576,C52, 'Mobile-Data'!$H$9:$H$1048576)=0,0,SUMIFS('Mobile-Data'!$H$9:$H$1048576, 'Mobile-Data'!$E$9:$E$1048576,B52, 'Mobile-Data'!$G$9:$G$1048576,C52)/SUMIF('Mobile-Data'!$G$9:$G$1048576,C52, 'Mobile-Data'!$H$9:$H$1048576))","v":0},{"$f":"'Mobile-Detail Calcs'!$J$149","v":0},0,0,0,null,"Passenger Car","LPG",{"$f":"'Mobile-Detail Calcs'!L218","v":0},{"$f":"'Mobile-Detail Calcs'!U218","v":0},0,null,0,0,0,0,0,0,0,0,0,0,0,0,0,0,0,0,0,0,0,0,0]
[null,"Light Truck (Vans, Pickup Trucks, SUVs)","LPG",{"$f":"IF(SUMIF('Mobile-Data'!$G$9:$G$1048576,C53, 'Mobile-Data'!$H$9:$H$1048576)=0,0,SUMIFS('Mobile-Data'!$H$9:$H$1048576, 'Mobile-Data'!$E$9:$E$1048576,B53, 'Mobile-Data'!$G$9:$G$1048576,C53)/SUMIF('Mobile-Data'!$G$9:$G$1048576,C53, 'Mobile-Data'!$H$9:$H$1048576))","v":0},{"$f":"'Mobile-Detail Calcs'!$J$149","v":0},0,0,0,null,"Light Truck (Vans, Pickup Trucks, SUVs)","LPG",{"$f":"'Mobile-Detail Calcs'!M218","v":0},{"$f":"'Mobile-Detail Calcs'!V218","v":0},0,null,0,0,0,0,0,0,0,0,0,0,0,0,0,0,0,0,0,0,0,0,0]
[null,"Heavy-Duty Vehicle","LPG",{"$f":"IF(SUMIF('Mobile-Data'!$G$9:$G$1048576,C54, 'Mobile-Data'!$H$9:$H$1048576)=0,0,SUMIFS('Mobile-Data'!$H$9:$H$1048576, 'Mobile-Data'!$E$9:$E$1048576,B54, 'Mobile-Data'!$G$9:$G$1048576,C54)/SUMIF('Mobile-Data'!$G$9:$G$1048576,C54, 'Mobile-Data'!$H$9:$H$1048576))","v":0},{"$f":"'Mobile-Detail Calcs'!$J$149","v":0},0,0,0,null,"Heavy-Duty Vehicle","LPG",{"$f":"'Mobile-Detail Calcs'!N218","v":0},{"$f":"'Mobile-Detail Calcs'!W218","v":0},0,null,0,0,0,0,0,0,0,0,0,0,0,0,0,0,0,0,0,0,0,0,0]
[]
[]
[null,"Vehicle Type","MT CO2e"]
[null,"Passenger Car",{"$f":"SUM(H31,H34,H37,H40,H43,H46,H49,H52)","v":0}]
[null,"Light Truck (Vans, Pickup Trucks, SUVs)",{"$f":"SUM(H32,H35,H38,H41,H44,H47,H50,H53)","v":0}]
[null,"Heavy-Duty Vehicle",1.5865279326000001]
[]
[null,"Off-Road CO2 emissions",null,"% fuel use","Fuel Type Emissions","CO2",null,null,"Off-Road Inventory Year Emissions:"]
[null,"(all)","Residual Fuel",null,null,{"$f":"'Mobile-Detail Calcs'!K149","v":0},null,null,{"$f":"IF(F69+C94>0,F69+C94,0)","v":{"$error":"#DIV/0!"}},"MT CO2e"]
[null,"(all)","Jet Fuel",null,null,{"$f":"'Mobile-Detail Calcs'!L149","v":0}]
[null,"(all)","Aviation Gasoline",null,null,{"$f":"'Mobile-Detail Calcs'!M149","v":0},null,null,"Therefore, On-Road Inventory Year Emissions ="]
[null,"Ship or Boat","Gasoline",{"$f":"SUMIFS('Mobile-Data'!$H$9:$H$1048576, 'Mobile-Data'!$E$9:$E$1048576,B66, 'Mobile-Data'!$G$9:$G$1048576,C66)/SUMIF('Mobile-Data'!$G$9:$G$1048576,C66, 'Mobile-Data'!$H$9:$H$1048576)","v":{"$error":"#DIV/0!"}},{"$f":"'Mobile-Detail Calcs'!$C$149","v":0},{"$f":"D66*E66","v":{"$error":"#DIV/0!"}},null,null,{"$f":"'Mobile-Summary'!F27-mob_nonHwy_emissionsIY","v":{"$error":"#DIV/0!"}},"MT CO2e"]
[null,"Ship or Boat","Diesel",{"$f":"IFERROR(SUMIFS('Mobile-Data'!$H$9:$H$1048576, 'Mobile-Data'!$E$9:$E$1048576,B67, 'Mobile-Data'!$G$9:$G$1048576,C67)/SUMIF('Mobile-Data'!$G$9:$G$1048576,C67, 'Mobile-Data'!$H$9:$H$1048576),0)","v":0},{"$f":"'Mobile-Detail Calcs'!$D$149","v":0},{"$f":"D67*E67","v":0}]
[null,"Locomotive","Diesel",{"$f":"IFERROR(SUMIFS('Mobile-Data'!$H$9:$H$1048576, 'Mobile-Data'!$E$9:$E$1048576,B68, 'Mobile-Data'!$G$9:$G$1048576,C68)/SUMIF('Mobile-Data'!$G$9:$G$1048576,C68, 'Mobile-Data'!$H$9:$H$1048576),0)","v":0},{"$f":"'Mobile-Detail Calcs'!$D$149","v":0},0]
[null,"Non-Highway CO2 Emissions",null,null,null,{"$f":"SUM(F63:F68)","v":{"$error":"#DIV/0!"}}]
[]
[null,"Off-Road Non-CO2 Emissions"]
[null,"Non-Highway Non-CO2 Emissions"]
[null,null,"Non-CO2"]
[null,{"$f":"'Background Controls'!I5","v":0},0]
[null,{"$f":"'Background Controls'!I6","v":0},0]
[null,{"$f":"'Background Controls'!I7","v":0},0]
[null,{"$f":"'Background Controls'!I8","v":0},0]
[null,{"$f":"'Background Controls'!I9","v":0},0]
[null,{"$f":"'Background Controls'!I10","v":0},0]
[null,{"$f":"'Background Controls'!I11","v":0},0]
[null,{"$f":"'Background Controls'!I12","v":0},0]
[null,{"$f":"'Background Controls'!I13","v":0},0]
[null,{"$f":"'Background Controls'!I14","v":0},0]
[null,{"$f":"'Background Controls'!I15","v":0},0]
[null,{"$f":"'Background Controls'!I16","v":0},0]
[null,{"$f":"'Background Controls'!I17","v":0},0]
[null,{"$f":"'Background Controls'!I18","v":0},0]
[null,{"$f":"'Background Controls'!I19","v":0},0]
[null,{"$f":"'Background Controls'!I20","v":0},0]
[null,{"$f":"'Background Controls'!I21","v":0},0]
[null,{"$f":"'Background Controls'!I22","v":0},0]
[null,{"$f":"'Background Controls'!I23","v":0},0]
[null,{"$f":"'Background Controls'!I24","v":0},0]
[null,"Total",{"$f":"SUM(mob_nonCO2_nonhwy)","v":0}]

{"sheet":"Notes","index":35,"n_rows":1,"n_cols":1,"rows_kept":1,"cut":false,"hidden":false,"merged":[]}
["Notes"]